CRAN Package Check Results for Package ForecastFramework

Last updated on 2020-08-03 05:48:46 CEST.

Flavor Version Tinstall Tcheck Ttotal Status Flags
r-devel-linux-x86_64-debian-clang 0.10.3 23.47 287.88 311.35 ERROR
r-devel-linux-x86_64-debian-gcc 0.10.3 22.19 244.52 266.71 ERROR
r-devel-linux-x86_64-fedora-clang 0.10.3 382.91 ERROR
r-devel-linux-x86_64-fedora-gcc 0.10.3 391.57 ERROR
r-devel-windows-ix86+x86_64 0.10.3 50.00 373.00 423.00 ERROR
r-patched-linux-x86_64 0.10.3 27.05 207.87 234.92 OK
r-patched-solaris-x86 0.10.3 376.20 OK
r-release-linux-x86_64 0.10.3 24.11 204.09 228.20 OK
r-release-macos-x86_64 0.10.3 OK
r-release-windows-ix86+x86_64 0.10.3 49.00 267.00 316.00 OK
r-oldrel-macos-x86_64 0.10.3 OK
r-oldrel-windows-ix86+x86_64 0.10.3 35.00 190.00 225.00 OK

Check Details

Version: 0.10.3
Check: tests
Result: ERROR
     Running 'testthat.R' [216s/238s]
    Running the tests in 'tests/testthat.R' failed.
    Complete output:
     > library(testthat)
     > test_check("ForecastFramework")
     Loading required package: ForecastFramework
     Loading required package: R6
     -- 1. Error: Full IncidenceMatrix : Active bindings have correct mode. --------
     argument is of length zero
     Backtrace:
    
     -- 2. Error: Full IncidenceMatrix : tail respects mat -------------------------
     argument is of length zero
     Backtrace:
    
     -- 3. Error: Full IncidenceMatrix : mutate works ------------------------------
     argument is of length zero
     Backtrace:
    
     -- 4. Error: Full IncidenceMatrix : mutate respects nrow ----------------------
     argument is of length zero
     Backtrace:
    
     -- 5. Error: Full IncidenceMatrix : mutate respects ncol ----------------------
     argument is of length zero
     Backtrace:
    
     -- 6. Error: Full IncidenceMatrix : mutate respects rnames --------------------
     argument is of length zero
     Backtrace:
    
     -- 7. Error: Full IncidenceMatrix : mutate respects cnames --------------------
     argument is of length zero
     Backtrace:
    
     -- 8. Error: Full IncidenceMatrix : mutate respects metaData ------------------
     argument is of length zero
     Backtrace:
    
     -- 9. Error: Full IncidenceMatrix : mutate respects rowData -------------------
     argument is of length zero
     Backtrace:
    
     -- 10. Error: Full IncidenceMatrix : mutate respects colData ------------------
     argument is of length zero
     Backtrace:
    
     -- 11. Error: Full IncidenceMatrix : subset respects mat ----------------------
     argument is of length zero
     Backtrace:
    
     -- 12. Error: Full IncidenceMatrix : mutate works -----------------------------
     argument is of length zero
     Backtrace:
    
     -- 13. Error: Full IncidenceMatrix : mutate respects nrow ---------------------
     argument is of length zero
     Backtrace:
    
     -- 14. Error: Full IncidenceMatrix : mutate respects ncol ---------------------
     argument is of length zero
     Backtrace:
    
     -- 15. Error: Full IncidenceMatrix : mutate respects rnames -------------------
     argument is of length zero
     Backtrace:
    
     -- 16. Error: Full IncidenceMatrix : mutate respects cnames -------------------
     argument is of length zero
     Backtrace:
    
     -- 17. Error: Full IncidenceMatrix : mutate respects metaData -----------------
     argument is of length zero
     Backtrace:
    
     -- 18. Error: Full IncidenceMatrix : mutate respects rowData ------------------
     argument is of length zero
     Backtrace:
    
     -- 19. Error: Full IncidenceMatrix : mutate respects colData ------------------
     argument is of length zero
     Backtrace:
    
     -- 20. Error: Full IncidenceMatrix : subset respects mat ----------------------
     argument is of length zero
     Backtrace:
    
     -- 21. Error: Full IncidenceMatrix : addColumns respects mat ------------------
     argument is of length zero
     Backtrace:
    
     -- 22. Error: Full IncidenceMatrix : addRows respects mat ---------------------
     argument is of length zero
     Backtrace:
    
     -- 23. Error: Full IncidenceMatrix : mutate respects mat ----------------------
     argument is of length zero
     Backtrace:
    
     -- 24. Error: Full IncidenceMatrix : diff works -------------------------------
     argument is of length zero
     Backtrace:
    
     -- 25. Error: Full IncidenceMatrix : diff respects ncol -----------------------
     argument is of length zero
     Backtrace:
    
     -- 26. Error: Full IncidenceMatrix : diff respects nrow -----------------------
     argument is of length zero
     Backtrace:
    
     -- 27. Error: Full IncidenceMatrix : diff respects rnames ---------------------
     argument is of length zero
     Backtrace:
    
     -- 28. Error: Full IncidenceMatrix : diff respects cnames ---------------------
     argument is of length zero
     Backtrace:
    
     -- 29. Error: Full IncidenceMatrix : diff respects colData --------------------
     argument is of length zero
     Backtrace:
    
     -- 30. Error: Full IncidenceMatrix : diff respects mat ------------------------
     argument is of length zero
     Backtrace:
    
     -- 31. Error: Full IncidenceMatrix : diff respects metaData -------------------
     argument is of length zero
     Backtrace:
    
     -- 32. Error: Full IncidenceMatrix : diff respects rowData --------------------
     argument is of length zero
     Backtrace:
    
     -- 33. Error: Full IncidenceMatrix : head respects mat ------------------------
     argument is of length zero
     Backtrace:
    
     -- 34. Error: Full IncidenceMatrix : scale works ------------------------------
     argument is of length zero
     Backtrace:
    
     -- 35. Error: Full IncidenceMatrix : scale respects nrow ----------------------
     argument is of length zero
     Backtrace:
    
     -- 36. Error: Full IncidenceMatrix : scale respects ncol ----------------------
     argument is of length zero
     Backtrace:
    
     -- 37. Error: Full IncidenceMatrix : scale respects cnames --------------------
     argument is of length zero
     Backtrace:
    
     -- 38. Error: Full IncidenceMatrix : scale respects rnames --------------------
     argument is of length zero
     Backtrace:
    
     -- 39. Error: Full IncidenceMatrix : scale respects colData -------------------
     argument is of length zero
     Backtrace:
    
     -- 40. Error: Full IncidenceMatrix : scale respects rowData -------------------
     argument is of length zero
     Backtrace:
    
     -- 41. Error: Full IncidenceMatrix : scale respects metaData ------------------
     argument is of length zero
     Backtrace:
    
     -- 42. Error: Full IncidenceMatrix : scale respects mat -----------------------
     argument is of length zero
     Backtrace:
    
     -- 43. Error: Full SimulatedIncidenceMatrix : Active bindings have correct mode.
     no method or default for coercing "character" to "factor"
     Backtrace:
     1. testthat::expect_equal(first_object, object)
     16. methods::as(tmp_frame$Var1, class(frame$Var1))
    
     -- 44. Error: Full SimulatedIncidenceMatrix : tail respects mat ---------------
     no method or default for coercing "character" to "factor"
     Backtrace:
     1. testthat::expect_equal(object, firstObject)
     16. methods::as(tmp_frame$Var1, class(frame$Var1))
    
     -- 45. Error: Full SimulatedIncidenceMatrix : tail respects simulations -------
     no method or default for coercing "character" to "factor"
     Backtrace:
     1. testthat::expect_equal(object, firstObject)
     16. methods::as(tmp_frame$Var1, class(frame$Var1))
    
     -- 46. Error: Full SimulatedIncidenceMatrix : tail respects arr ---------------
     no method or default for coercing "character" to "factor"
     Backtrace:
     1. testthat::expect_equal(object, firstObject)
     16. methods::as(tmp_frame$Var1, class(frame$Var1))
    
     -- 47. Error: Full SimulatedIncidenceMatrix : mutate works --------------------
     no method or default for coercing "character" to "factor"
     Backtrace:
     1. testthat::expect_equal(object, firstObject)
     16. methods::as(tmp_frame$Var1, class(frame$Var1))
    
     -- 48. Error: Full SimulatedIncidenceMatrix : subset respects mat -------------
     no method or default for coercing "character" to "factor"
     Backtrace:
     1. testthat::expect_equal(object, firstObject)
     16. methods::as(tmp_frame$Var1, class(frame$Var1))
    
     -- 49. Error: Full SimulatedIncidenceMatrix : subset respects simulations -----
     no method or default for coercing "character" to "factor"
     Backtrace:
     1. testthat::expect_equal(object, firstObject)
     16. methods::as(tmp_frame$Var1, class(frame$Var1))
    
     -- 50. Error: Full SimulatedIncidenceMatrix : subset respects arr -------------
     no method or default for coercing "character" to "factor"
     Backtrace:
     1. testthat::expect_equal(object, firstObject)
     16. methods::as(tmp_frame$Var1, class(frame$Var1))
    
     -- 51. Error: Full SimulatedIncidenceMatrix : mutate works --------------------
     no method or default for coercing "character" to "factor"
     Backtrace:
     1. testthat::expect_equal(object, firstObject)
     16. methods::as(tmp_frame$Var1, class(frame$Var1))
    
     -- 52. Error: Full SimulatedIncidenceMatrix : subset respects mat -------------
     no method or default for coercing "character" to "factor"
     Backtrace:
     1. testthat::expect_equal(object, firstObject)
     16. methods::as(tmp_frame$Var1, class(frame$Var1))
    
     -- 53. Error: Full SimulatedIncidenceMatrix : subset respects simulations -----
     no method or default for coercing "character" to "factor"
     Backtrace:
     1. testthat::expect_equal(object, firstObject)
     16. methods::as(tmp_frame$Var1, class(frame$Var1))
    
     -- 54. Error: Full SimulatedIncidenceMatrix : subset respects arr -------------
     no method or default for coercing "character" to "factor"
     Backtrace:
     1. testthat::expect_equal(object, firstObject)
     16. methods::as(tmp_frame$Var1, class(frame$Var1))
    
     -- 55. Error: Full SimulatedIncidenceMatrix : addColumns respects mat ---------
     no method or default for coercing "character" to "factor"
     Backtrace:
     1. testthat::expect_equal(object, firstObject)
     16. methods::as(tmp_frame$Var1, class(frame$Var1))
    
     -- 56. Error: Full SimulatedIncidenceMatrix : addColumns respects simulations -
     no method or default for coercing "character" to "factor"
     Backtrace:
     1. testthat::expect_equal(object, firstObject)
     16. methods::as(tmp_frame$Var1, class(frame$Var1))
    
     -- 57. Error: Full SimulatedIncidenceMatrix : addColumns respects arr ---------
     no method or default for coercing "character" to "factor"
     Backtrace:
     1. testthat::expect_equal(object, firstObject)
     16. methods::as(tmp_frame$Var1, class(frame$Var1))
    
     -- 58. Error: Full SimulatedIncidenceMatrix : addRows respects mat ------------
     no method or default for coercing "character" to "factor"
     Backtrace:
     1. testthat::expect_equal(object, firstObject)
     16. methods::as(tmp_frame$Var1, class(frame$Var1))
    
     -- 59. Error: Full SimulatedIncidenceMatrix : addRows respects simulations ----
     no method or default for coercing "character" to "factor"
     Backtrace:
     1. testthat::expect_equal(object, firstObject)
     16. methods::as(tmp_frame$Var1, class(frame$Var1))
    
     -- 60. Error: Full SimulatedIncidenceMatrix : addRows respects arr ------------
     no method or default for coercing "character" to "factor"
     Backtrace:
     1. testthat::expect_equal(object, firstObject)
     16. methods::as(tmp_frame$Var1, class(frame$Var1))
    
     -- 61. Error: Full SimulatedIncidenceMatrix : diff works ----------------------
     no method or default for coercing "character" to "factor"
     Backtrace:
     1. testthat::expect_equal(object, first_object)
     16. methods::as(tmp_frame$Var1, class(frame$Var1))
    
     -- 62. Error: Full SimulatedIncidenceMatrix : diff respects cnames ------------
     no method or default for coercing "character" to "factor"
     Backtrace:
     1. testthat::expect_equal(object, first_object)
     16. methods::as(tmp_frame$Var1, class(frame$Var1))
    
     -- 63. Error: Full SimulatedIncidenceMatrix : diff respects ncol --------------
     no method or default for coercing "character" to "factor"
     Backtrace:
     1. testthat::expect_equal(object, first_object)
     16. methods::as(tmp_frame$Var1, class(frame$Var1))
    
     -- 64. Error: Full SimulatedIncidenceMatrix : diff respects nsim --------------
     no method or default for coercing "character" to "factor"
     Backtrace:
     1. testthat::expect_equal(object, first_object)
     16. methods::as(tmp_frame$Var1, class(frame$Var1))
    
     -- 65. Error: Full SimulatedIncidenceMatrix : diff respects nrow --------------
     no method or default for coercing "character" to "factor"
     Backtrace:
     1. testthat::expect_equal(object, first_object)
     16. methods::as(tmp_frame$Var1, class(frame$Var1))
    
     -- 66. Error: Full SimulatedIncidenceMatrix : diff respects rnames ------------
     no method or default for coercing "character" to "factor"
     Backtrace:
     1. testthat::expect_equal(object, first_object)
     16. methods::as(tmp_frame$Var1, class(frame$Var1))
    
     -- 67. Error: Full SimulatedIncidenceMatrix : diff respects colData -----------
     no method or default for coercing "character" to "factor"
     Backtrace:
     1. testthat::expect_equal(object, first_object)
     16. methods::as(tmp_frame$Var1, class(frame$Var1))
    
     -- 68. Error: Full SimulatedIncidenceMatrix : diff respects mat ---------------
     no method or default for coercing "character" to "factor"
     Backtrace:
     1. testthat::expect_equal(object, first_object)
     16. methods::as(tmp_frame$Var1, class(frame$Var1))
    
     -- 69. Error: Full SimulatedIncidenceMatrix : diff respects simulations -------
     no method or default for coercing "character" to "factor"
     Backtrace:
     1. testthat::expect_equal(object, first_object)
     16. methods::as(tmp_frame$Var1, class(frame$Var1))
    
     -- 70. Error: Full SimulatedIncidenceMatrix : diff respects arr ---------------
     no method or default for coercing "character" to "factor"
     Backtrace:
     1. testthat::expect_equal(object, first_object)
     16. methods::as(tmp_frame$Var1, class(frame$Var1))
    
     -- 71. Error: Full SimulatedIncidenceMatrix : diff respects metaData ----------
     no method or default for coercing "character" to "factor"
     Backtrace:
     1. testthat::expect_equal(object, first_object)
     16. methods::as(tmp_frame$Var1, class(frame$Var1))
    
     -- 72. Error: Full SimulatedIncidenceMatrix : diff respects rowData -----------
     no method or default for coercing "character" to "factor"
     Backtrace:
     1. testthat::expect_equal(object, first_object)
     16. methods::as(tmp_frame$Var1, class(frame$Var1))
    
     -- 73. Error: Full SimulatedIncidenceMatrix : head respects mat ---------------
     no method or default for coercing "character" to "factor"
     Backtrace:
     1. testthat::expect_equal(object, firstObject)
     16. methods::as(tmp_frame$Var1, class(frame$Var1))
    
     -- 74. Error: Full SimulatedIncidenceMatrix : head respects simulations -------
     no method or default for coercing "character" to "factor"
     Backtrace:
     1. testthat::expect_equal(object, firstObject)
     16. methods::as(tmp_frame$Var1, class(frame$Var1))
    
     -- 75. Error: Full SimulatedIncidenceMatrix : head respects arr ---------------
     no method or default for coercing "character" to "factor"
     Backtrace:
     1. testthat::expect_equal(object, firstObject)
     16. methods::as(tmp_frame$Var1, class(frame$Var1))
    
     -- 76. Error: Full SimulatedIncidenceMatrix : scale works ---------------------
     no method or default for coercing "character" to "factor"
     Backtrace:
     1. testthat::expect_equal(first_object, object)
     16. methods::as(tmp_frame$Var1, class(frame$Var1))
    
     -- 77. Error: Full SimulatedIncidenceMatrix : scale respects nrow -------------
     no method or default for coercing "character" to "factor"
     Backtrace:
     1. testthat::expect_equal(first_object, object)
     16. methods::as(tmp_frame$Var1, class(frame$Var1))
    
     -- 78. Error: Full SimulatedIncidenceMatrix : scale respects ncol -------------
     no method or default for coercing "character" to "factor"
     Backtrace:
     1. testthat::expect_equal(first_object, object)
     16. methods::as(tmp_frame$Var1, class(frame$Var1))
    
     -- 79. Error: Full SimulatedIncidenceMatrix : scale respects nsim -------------
     no method or default for coercing "character" to "factor"
     Backtrace:
     1. testthat::expect_equal(first_object, object)
     16. methods::as(tmp_frame$Var1, class(frame$Var1))
    
     -- 80. Error: Full SimulatedIncidenceMatrix : scale respects cnames -----------
     no method or default for coercing "character" to "factor"
     Backtrace:
     1. testthat::expect_equal(first_object, object)
     16. methods::as(tmp_frame$Var1, class(frame$Var1))
    
     -- 81. Error: Full SimulatedIncidenceMatrix : scale respects rnames -----------
     no method or default for coercing "character" to "factor"
     Backtrace:
     1. testthat::expect_equal(first_object, object)
     16. methods::as(tmp_frame$Var1, class(frame$Var1))
    
     -- 82. Error: Full SimulatedIncidenceMatrix : scale respects colData ----------
     no method or default for coercing "character" to "factor"
     Backtrace:
     1. testthat::expect_equal(first_object, object)
     16. methods::as(tmp_frame$Var1, class(frame$Var1))
    
     -- 83. Error: Full SimulatedIncidenceMatrix : scale respects rowData ----------
     no method or default for coercing "character" to "factor"
     Backtrace:
     1. testthat::expect_equal(first_object, object)
     16. methods::as(tmp_frame$Var1, class(frame$Var1))
    
     -- 84. Error: Full SimulatedIncidenceMatrix : scale respects metaData ---------
     no method or default for coercing "character" to "factor"
     Backtrace:
     1. testthat::expect_equal(first_object, object)
     16. methods::as(tmp_frame$Var1, class(frame$Var1))
    
     -- 85. Error: Full SimulatedIncidenceMatrix : scale respects mat --------------
     no method or default for coercing "character" to "factor"
     Backtrace:
     1. testthat::expect_equal(first_object, object)
     16. methods::as(tmp_frame$Var1, class(frame$Var1))
    
     -- 86. Error: Full SimulatedIncidenceMatrix : scale respects simulations ------
     no method or default for coercing "character" to "factor"
     Backtrace:
     1. testthat::expect_equal(first_object, object)
     16. methods::as(tmp_frame$Var1, class(frame$Var1))
    
     -- 87. Error: Full SimulatedIncidenceMatrix : scale respects arr --------------
     no method or default for coercing "character" to "factor"
     Backtrace:
     1. testthat::expect_equal(first_object, object)
     16. methods::as(tmp_frame$Var1, class(frame$Var1))
    
     -- 88. Error: Full SimulatedIncidenceMatrix : addError works ------------------
     no method or default for coercing "character" to "factor"
     Backtrace:
     1. testthat::expect_equal(first_object, object)
     16. methods::as(tmp_frame$Var1, class(frame$Var1))
    
     -- 89. Error: Full SimulatedIncidenceMatrix : addError respects ncol ----------
     no method or default for coercing "character" to "factor"
     Backtrace:
     1. testthat::expect_equal(first_object, object)
     16. methods::as(tmp_frame$Var1, class(frame$Var1))
    
     -- 90. Error: Full SimulatedIncidenceMatrix : addError respects nrow ----------
     no method or default for coercing "character" to "factor"
     Backtrace:
     1. testthat::expect_equal(first_object, object)
     16. methods::as(tmp_frame$Var1, class(frame$Var1))
    
     -- 91. Error: Full SimulatedIncidenceMatrix : addError respects ncol ----------
     no method or default for coercing "character" to "factor"
     Backtrace:
     1. testthat::expect_equal(first_object, object)
     16. methods::as(tmp_frame$Var1, class(frame$Var1))
    
     -- 92. Error: Full SimulatedIncidenceMatrix : addError respects cnames --------
     no method or default for coercing "character" to "factor"
     Backtrace:
     1. testthat::expect_equal(first_object, object)
     16. methods::as(tmp_frame$Var1, class(frame$Var1))
    
     -- 93. Error: Full SimulatedIncidenceMatrix : addError respects rnames --------
     no method or default for coercing "character" to "factor"
     Backtrace:
     1. testthat::expect_equal(first_object, object)
     16. methods::as(tmp_frame$Var1, class(frame$Var1))
    
     -- 94. Error: Full SimulatedIncidenceMatrix : addError respects colData -------
     no method or default for coercing "character" to "factor"
     Backtrace:
     1. testthat::expect_equal(first_object, object)
     16. methods::as(tmp_frame$Var1, class(frame$Var1))
    
     -- 95. Error: Full SimulatedIncidenceMatrix : addError respects rowData -------
     no method or default for coercing "character" to "factor"
     Backtrace:
     1. testthat::expect_equal(first_object, object)
     16. methods::as(tmp_frame$Var1, class(frame$Var1))
    
     -- 96. Error: Full SimulatedIncidenceMatrix : addError respects metaData ------
     no method or default for coercing "character" to "factor"
     Backtrace:
     1. testthat::expect_equal(first_object, object)
     16. methods::as(tmp_frame$Var1, class(frame$Var1))
    
     -- 97. Error: Full SimulatedIncidenceMatrix : addError respects metaData ------
     no method or default for coercing "character" to "factor"
     Backtrace:
     1. testthat::expect_equal(first_object, object)
     16. methods::as(tmp_frame$Var1, class(frame$Var1))
    
     -- 98. Error: Full SimulatedIncidenceMatrix : addError respects nsim ----------
     no method or default for coercing "character" to "factor"
     Backtrace:
     1. testthat::expect_equal(first_object, object)
     16. methods::as(tmp_frame$Var1, class(frame$Var1))
    
     -- 99. Error: Full SimulatedIncidenceMatrix : addError respects nsim ----------
     no method or default for coercing "character" to "factor"
     Backtrace:
     1. testthat::expect_equal(first_object, object)
     16. methods::as(tmp_frame$Var1, class(frame$Var1))
    
     -- 100. Error: Full SimulatedIncidenceMatrix : addError respects mat ----------
     no method or default for coercing "character" to "factor"
     Backtrace:
     1. testthat::expect_equal(first_object, object)
     16. methods::as(tmp_frame$Var1, class(frame$Var1))
    
     -- 101. Error: Full SimulatedIncidenceMatrix : addError respects simulations --
     no method or default for coercing "character" to "factor"
     Backtrace:
     1. testthat::expect_equal(first_object, object)
     16. methods::as(tmp_frame$Var1, class(frame$Var1))
    
     -- 102. Error: Full SimulatedIncidenceMatrix : addError respects arr ----------
     no method or default for coercing "character" to "factor"
     Backtrace:
     1. testthat::expect_equal(first_object, object)
     16. methods::as(tmp_frame$Var1, class(frame$Var1))
    
     -- 103. Error: Full SimulatedIncidenceMatrix : summarize works ----------------
     no method or default for coercing "character" to "factor"
     Backtrace:
     1. testthat::expect_equal(first_object, object)
     16. methods::as(tmp_frame$Var1, class(frame$Var1))
    
     -- 104. Error: List SimulatedIncidenceMatrix : Active bindings have correct mode
     no method or default for coercing "character" to "factor"
     Backtrace:
     1. testthat::expect_equal(first_object, object)
     16. methods::as(tmp_frame$Var1, class(frame$Var1))
    
     -- 105. Error: List SimulatedIncidenceMatrix : tail respects mat --------------
     no method or default for coercing "character" to "factor"
     Backtrace:
     1. testthat::expect_equal(object, firstObject)
     16. methods::as(tmp_frame$Var1, class(frame$Var1))
    
     -- 106. Error: List SimulatedIncidenceMatrix : tail respects simulations ------
     no method or default for coercing "character" to "factor"
     Backtrace:
     1. testthat::expect_equal(object, firstObject)
     16. methods::as(tmp_frame$Var1, class(frame$Var1))
    
     -- 107. Error: List SimulatedIncidenceMatrix : tail respects arr --------------
     no method or default for coercing "character" to "factor"
     Backtrace:
     1. testthat::expect_equal(object, firstObject)
     16. methods::as(tmp_frame$Var1, class(frame$Var1))
    
     -- 108. Error: List SimulatedIncidenceMatrix : mutate works -------------------
     no method or default for coercing "character" to "factor"
     Backtrace:
     1. testthat::expect_equal(object, firstObject)
     16. methods::as(tmp_frame$Var1, class(frame$Var1))
    
     -- 109. Error: List SimulatedIncidenceMatrix : subset respects mat ------------
     no method or default for coercing "character" to "factor"
     Backtrace:
     1. testthat::expect_equal(object, firstObject)
     16. methods::as(tmp_frame$Var1, class(frame$Var1))
    
     -- 110. Error: List SimulatedIncidenceMatrix : subset respects simulations ----
     no method or default for coercing "character" to "factor"
     Backtrace:
     1. testthat::expect_equal(object, firstObject)
     16. methods::as(tmp_frame$Var1, class(frame$Var1))
    
     -- 111. Error: List SimulatedIncidenceMatrix : subset respects arr ------------
     no method or default for coercing "character" to "factor"
     Backtrace:
     1. testthat::expect_equal(object, firstObject)
     16. methods::as(tmp_frame$Var1, class(frame$Var1))
    
     -- 112. Error: List SimulatedIncidenceMatrix : mutate works -------------------
     no method or default for coercing "character" to "factor"
     Backtrace:
     1. testthat::expect_equal(object, firstObject)
     16. methods::as(tmp_frame$Var1, class(frame$Var1))
    
     -- 113. Error: List SimulatedIncidenceMatrix : subset respects mat ------------
     no method or default for coercing "character" to "factor"
     Backtrace:
     1. testthat::expect_equal(object, firstObject)
     16. methods::as(tmp_frame$Var1, class(frame$Var1))
    
     -- 114. Error: List SimulatedIncidenceMatrix : subset respects simulations ----
     no method or default for coercing "character" to "factor"
     Backtrace:
     1. testthat::expect_equal(object, firstObject)
     16. methods::as(tmp_frame$Var1, class(frame$Var1))
    
     -- 115. Error: List SimulatedIncidenceMatrix : subset respects arr ------------
     no method or default for coercing "character" to "factor"
     Backtrace:
     1. testthat::expect_equal(object, firstObject)
     16. methods::as(tmp_frame$Var1, class(frame$Var1))
    
     -- 116. Error: List SimulatedIncidenceMatrix : addColumns respects mat --------
     no method or default for coercing "character" to "factor"
     Backtrace:
     1. testthat::expect_equal(object, firstObject)
     16. methods::as(tmp_frame$Var1, class(frame$Var1))
    
     -- 117. Error: List SimulatedIncidenceMatrix : addColumns respects simulations
     no method or default for coercing "character" to "factor"
     Backtrace:
     1. testthat::expect_equal(object, firstObject)
     16. methods::as(tmp_frame$Var1, class(frame$Var1))
    
     -- 118. Error: List SimulatedIncidenceMatrix : addColumns respects arr --------
     no method or default for coercing "character" to "factor"
     Backtrace:
     1. testthat::expect_equal(object, firstObject)
     16. methods::as(tmp_frame$Var1, class(frame$Var1))
    
     -- 119. Error: List SimulatedIncidenceMatrix : addRows respects mat -----------
     no method or default for coercing "character" to "factor"
     Backtrace:
     1. testthat::expect_equal(object, firstObject)
     16. methods::as(tmp_frame$Var1, class(frame$Var1))
    
     -- 120. Error: List SimulatedIncidenceMatrix : addRows respects simulations ---
     no method or default for coercing "character" to "factor"
     Backtrace:
     1. testthat::expect_equal(object, firstObject)
     16. methods::as(tmp_frame$Var1, class(frame$Var1))
    
     -- 121. Error: List SimulatedIncidenceMatrix : addRows respects arr -----------
     no method or default for coercing "character" to "factor"
     Backtrace:
     1. testthat::expect_equal(object, firstObject)
     16. methods::as(tmp_frame$Var1, class(frame$Var1))
    
     -- 122. Error: List SimulatedIncidenceMatrix : diff works ---------------------
     no method or default for coercing "character" to "factor"
     Backtrace:
     1. testthat::expect_equal(object, first_object)
     16. methods::as(tmp_frame$Var1, class(frame$Var1))
    
     -- 123. Error: List SimulatedIncidenceMatrix : diff respects cnames -----------
     no method or default for coercing "character" to "factor"
     Backtrace:
     1. testthat::expect_equal(object, first_object)
     16. methods::as(tmp_frame$Var1, class(frame$Var1))
    
     -- 124. Error: List SimulatedIncidenceMatrix : diff respects ncol -------------
     no method or default for coercing "character" to "factor"
     Backtrace:
     1. testthat::expect_equal(object, first_object)
     16. methods::as(tmp_frame$Var1, class(frame$Var1))
    
     -- 125. Error: List SimulatedIncidenceMatrix : diff respects nsim -------------
     no method or default for coercing "character" to "factor"
     Backtrace:
     1. testthat::expect_equal(object, first_object)
     16. methods::as(tmp_frame$Var1, class(frame$Var1))
    
     -- 126. Error: List SimulatedIncidenceMatrix : diff respects nrow -------------
     no method or default for coercing "character" to "factor"
     Backtrace:
     1. testthat::expect_equal(object, first_object)
     16. methods::as(tmp_frame$Var1, class(frame$Var1))
    
     -- 127. Error: List SimulatedIncidenceMatrix : diff respects rnames -----------
     no method or default for coercing "character" to "factor"
     Backtrace:
     1. testthat::expect_equal(object, first_object)
     16. methods::as(tmp_frame$Var1, class(frame$Var1))
    
     -- 128. Error: List SimulatedIncidenceMatrix : diff respects colData ----------
     no method or default for coercing "character" to "factor"
     Backtrace:
     1. testthat::expect_equal(object, first_object)
     16. methods::as(tmp_frame$Var1, class(frame$Var1))
    
     -- 129. Error: List SimulatedIncidenceMatrix : diff respects mat --------------
     no method or default for coercing "character" to "factor"
     Backtrace:
     1. testthat::expect_equal(object, first_object)
     16. methods::as(tmp_frame$Var1, class(frame$Var1))
    
     -- 130. Error: List SimulatedIncidenceMatrix : diff respects simulations ------
     no method or default for coercing "character" to "factor"
     Backtrace:
     1. testthat::expect_equal(object, first_object)
     16. methods::as(tmp_frame$Var1, class(frame$Var1))
    
     -- 131. Error: List SimulatedIncidenceMatrix : diff respects arr --------------
     no method or default for coercing "character" to "factor"
     Backtrace:
     1. testthat::expect_equal(object, first_object)
     16. methods::as(tmp_frame$Var1, class(frame$Var1))
    
     -- 132. Error: List SimulatedIncidenceMatrix : diff respects metaData ---------
     no method or default for coercing "character" to "factor"
     Backtrace:
     1. testthat::expect_equal(object, first_object)
     16. methods::as(tmp_frame$Var1, class(frame$Var1))
    
     -- 133. Error: List SimulatedIncidenceMatrix : diff respects rowData ----------
     no method or default for coercing "character" to "factor"
     Backtrace:
     1. testthat::expect_equal(object, first_object)
     16. methods::as(tmp_frame$Var1, class(frame$Var1))
    
     -- 134. Error: List SimulatedIncidenceMatrix : head respects mat --------------
     no method or default for coercing "character" to "factor"
     Backtrace:
     1. testthat::expect_equal(object, firstObject)
     16. methods::as(tmp_frame$Var1, class(frame$Var1))
    
     -- 135. Error: List SimulatedIncidenceMatrix : head respects simulations ------
     no method or default for coercing "character" to "factor"
     Backtrace:
     1. testthat::expect_equal(object, firstObject)
     16. methods::as(tmp_frame$Var1, class(frame$Var1))
    
     -- 136. Error: List SimulatedIncidenceMatrix : head respects arr --------------
     no method or default for coercing "character" to "factor"
     Backtrace:
     1. testthat::expect_equal(object, firstObject)
     16. methods::as(tmp_frame$Var1, class(frame$Var1))
    
     -- 137. Error: List SimulatedIncidenceMatrix : scale works --------------------
     no method or default for coercing "character" to "factor"
     Backtrace:
     1. testthat::expect_equal(first_object, object)
     16. methods::as(tmp_frame$Var1, class(frame$Var1))
    
     -- 138. Error: List SimulatedIncidenceMatrix : scale respects nrow ------------
     no method or default for coercing "character" to "factor"
     Backtrace:
     1. testthat::expect_equal(first_object, object)
     16. methods::as(tmp_frame$Var1, class(frame$Var1))
    
     -- 139. Error: List SimulatedIncidenceMatrix : scale respects ncol ------------
     no method or default for coercing "character" to "factor"
     Backtrace:
     1. testthat::expect_equal(first_object, object)
     16. methods::as(tmp_frame$Var1, class(frame$Var1))
    
     -- 140. Error: List SimulatedIncidenceMatrix : scale respects nsim ------------
     no method or default for coercing "character" to "factor"
     Backtrace:
     1. testthat::expect_equal(first_object, object)
     16. methods::as(tmp_frame$Var1, class(frame$Var1))
    
     -- 141. Error: List SimulatedIncidenceMatrix : scale respects cnames ----------
     no method or default for coercing "character" to "factor"
     Backtrace:
     1. testthat::expect_equal(first_object, object)
     16. methods::as(tmp_frame$Var1, class(frame$Var1))
    
     -- 142. Error: List SimulatedIncidenceMatrix : scale respects rnames ----------
     no method or default for coercing "character" to "factor"
     Backtrace:
     1. testthat::expect_equal(first_object, object)
     16. methods::as(tmp_frame$Var1, class(frame$Var1))
    
     -- 143. Error: List SimulatedIncidenceMatrix : scale respects colData ---------
     no method or default for coercing "character" to "factor"
     Backtrace:
     1. testthat::expect_equal(first_object, object)
     16. methods::as(tmp_frame$Var1, class(frame$Var1))
    
     -- 144. Error: List SimulatedIncidenceMatrix : scale respects rowData ---------
     no method or default for coercing "character" to "factor"
     Backtrace:
     1. testthat::expect_equal(first_object, object)
     16. methods::as(tmp_frame$Var1, class(frame$Var1))
    
     -- 145. Error: List SimulatedIncidenceMatrix : scale respects metaData --------
     no method or default for coercing "character" to "factor"
     Backtrace:
     1. testthat::expect_equal(first_object, object)
     16. methods::as(tmp_frame$Var1, class(frame$Var1))
    
     -- 146. Error: List SimulatedIncidenceMatrix : scale respects mat -------------
     no method or default for coercing "character" to "factor"
     Backtrace:
     1. testthat::expect_equal(first_object, object)
     16. methods::as(tmp_frame$Var1, class(frame$Var1))
    
     -- 147. Error: List SimulatedIncidenceMatrix : scale respects simulations -----
     no method or default for coercing "character" to "factor"
     Backtrace:
     1. testthat::expect_equal(first_object, object)
     16. methods::as(tmp_frame$Var1, class(frame$Var1))
    
     -- 148. Error: List SimulatedIncidenceMatrix : scale respects arr -------------
     no method or default for coercing "character" to "factor"
     Backtrace:
     1. testthat::expect_equal(first_object, object)
     16. methods::as(tmp_frame$Var1, class(frame$Var1))
    
     -- 149. Error: List SimulatedIncidenceMatrix : addError works -----------------
     no method or default for coercing "character" to "factor"
     Backtrace:
     1. testthat::expect_equal(first_object, object)
     16. methods::as(tmp_frame$Var1, class(frame$Var1))
    
     -- 150. Error: List SimulatedIncidenceMatrix : addError respects ncol ---------
     no method or default for coercing "character" to "factor"
     Backtrace:
     1. testthat::expect_equal(first_object, object)
     16. methods::as(tmp_frame$Var1, class(frame$Var1))
    
     -- 151. Error: List SimulatedIncidenceMatrix : addError respects nrow ---------
     no method or default for coercing "character" to "factor"
     Backtrace:
     1. testthat::expect_equal(first_object, object)
     16. methods::as(tmp_frame$Var1, class(frame$Var1))
    
     -- 152. Error: List SimulatedIncidenceMatrix : addError respects ncol ---------
     no method or default for coercing "character" to "factor"
     Backtrace:
     1. testthat::expect_equal(first_object, object)
     16. methods::as(tmp_frame$Var1, class(frame$Var1))
    
     -- 153. Error: List SimulatedIncidenceMatrix : addError respects cnames -------
     no method or default for coercing "character" to "factor"
     Backtrace:
     1. testthat::expect_equal(first_object, object)
     16. methods::as(tmp_frame$Var1, class(frame$Var1))
    
     -- 154. Error: List SimulatedIncidenceMatrix : addError respects rnames -------
     no method or default for coercing "character" to "factor"
     Backtrace:
     1. testthat::expect_equal(first_object, object)
     16. methods::as(tmp_frame$Var1, class(frame$Var1))
    
     -- 155. Error: List SimulatedIncidenceMatrix : addError respects colData ------
     no method or default for coercing "character" to "factor"
     Backtrace:
     1. testthat::expect_equal(first_object, object)
     16. methods::as(tmp_frame$Var1, class(frame$Var1))
    
     -- 156. Error: List SimulatedIncidenceMatrix : addError respects rowData ------
     no method or default for coercing "character" to "factor"
     Backtrace:
     1. testthat::expect_equal(first_object, object)
     16. methods::as(tmp_frame$Var1, class(frame$Var1))
    
     -- 157. Error: List SimulatedIncidenceMatrix : addError respects metaData -----
     no method or default for coercing "character" to "factor"
     Backtrace:
     1. testthat::expect_equal(first_object, object)
     16. methods::as(tmp_frame$Var1, class(frame$Var1))
    
     -- 158. Error: List SimulatedIncidenceMatrix : addError respects metaData -----
     no method or default for coercing "character" to "factor"
     Backtrace:
     1. testthat::expect_equal(first_object, object)
     16. methods::as(tmp_frame$Var1, class(frame$Var1))
    
     -- 159. Error: List SimulatedIncidenceMatrix : addError respects nsim ---------
     no method or default for coercing "character" to "factor"
     Backtrace:
     1. testthat::expect_equal(first_object, object)
     16. methods::as(tmp_frame$Var1, class(frame$Var1))
    
     -- 160. Error: List SimulatedIncidenceMatrix : addError respects nsim ---------
     no method or default for coercing "character" to "factor"
     Backtrace:
     1. testthat::expect_equal(first_object, object)
     16. methods::as(tmp_frame$Var1, class(frame$Var1))
    
     -- 161. Error: List SimulatedIncidenceMatrix : addError respects mat ----------
     no method or default for coercing "character" to "factor"
     Backtrace:
     1. testthat::expect_equal(first_object, object)
     16. methods::as(tmp_frame$Var1, class(frame$Var1))
    
     -- 162. Error: List SimulatedIncidenceMatrix : addError respects simulations --
     no method or default for coercing "character" to "factor"
     Backtrace:
     1. testthat::expect_equal(first_object, object)
     16. methods::as(tmp_frame$Var1, class(frame$Var1))
    
     -- 163. Error: List SimulatedIncidenceMatrix : addError respects arr ----------
     no method or default for coercing "character" to "factor"
     Backtrace:
     1. testthat::expect_equal(first_object, object)
     16. methods::as(tmp_frame$Var1, class(frame$Var1))
    
     -- 164. Error: List SimulatedIncidenceMatrix : summarize works ----------------
     no method or default for coercing "character" to "factor"
     Backtrace:
     1. testthat::expect_equal(first_object, object)
     16. methods::as(tmp_frame$Var1, class(frame$Var1))
    
     -- 165. Error: Full IncidenceForecast : mean works ----------------------------
     no method or default for coercing "character" to "factor"
     Backtrace:
     1. testthat::expect_that(...)
     20. methods::as(tmp_frame$Var1, class(frame$Var1))
    
     -- 166. Error: Full IncidenceForecast : median works --------------------------
     no method or default for coercing "character" to "factor"
     Backtrace:
     1. testthat::expect_that(...)
     20. methods::as(tmp_frame$Var1, class(frame$Var1))
    
     -- 167. Error: Full IncidenceForecast : Inherited Methods don't change object -
     no method or default for coercing "character" to "factor"
     Backtrace:
     1. equivalence(first_object)(object)
     19. methods::as(tmp_frame$Var1, class(frame$Var1))
    
     -- 168. Error: Full IncidenceForecast : sample works --------------------------
     no method or default for coercing "character" to "factor"
     Backtrace:
     1. testthat::expect_that(first_object, equals(object))
     28. methods::as(tmp_frame$Var1, class(frame$Var1))
    
     == testthat results ===========================================================
     [ OK: 10173 | SKIPPED: 207 | WARNINGS: 123 | FAILED: 168 ]
     1. Error: Full IncidenceMatrix : Active bindings have correct mode.
     2. Error: Full IncidenceMatrix : tail respects mat
     3. Error: Full IncidenceMatrix : mutate works
     4. Error: Full IncidenceMatrix : mutate respects nrow
     5. Error: Full IncidenceMatrix : mutate respects ncol
     6. Error: Full IncidenceMatrix : mutate respects rnames
     7. Error: Full IncidenceMatrix : mutate respects cnames
     8. Error: Full IncidenceMatrix : mutate respects metaData
     9. Error: Full IncidenceMatrix : mutate respects rowData
     1. ...
    
     Error: testthat unit tests failed
     Execution halted
Flavor: r-devel-linux-x86_64-debian-clang

Version: 0.10.3
Check: tests
Result: ERROR
     Running ‘testthat.R’ [190s/272s]
    Running the tests in ‘tests/testthat.R’ failed.
    Complete output:
     > library(testthat)
     > test_check("ForecastFramework")
     Loading required package: ForecastFramework
     Loading required package: R6
     ── 1. Error: Full IncidenceMatrix : Active bindings have correct mode. ────────
     argument is of length zero
     Backtrace:
    
     ── 2. Error: Full IncidenceMatrix : tail respects mat ─────────────────────────
     argument is of length zero
     Backtrace:
    
     ── 3. Error: Full IncidenceMatrix : mutate works ──────────────────────────────
     argument is of length zero
     Backtrace:
    
     ── 4. Error: Full IncidenceMatrix : mutate respects nrow ──────────────────────
     argument is of length zero
     Backtrace:
    
     ── 5. Error: Full IncidenceMatrix : mutate respects ncol ──────────────────────
     argument is of length zero
     Backtrace:
    
     ── 6. Error: Full IncidenceMatrix : mutate respects rnames ────────────────────
     argument is of length zero
     Backtrace:
    
     ── 7. Error: Full IncidenceMatrix : mutate respects cnames ────────────────────
     argument is of length zero
     Backtrace:
    
     ── 8. Error: Full IncidenceMatrix : mutate respects metaData ──────────────────
     argument is of length zero
     Backtrace:
    
     ── 9. Error: Full IncidenceMatrix : mutate respects rowData ───────────────────
     argument is of length zero
     Backtrace:
    
     ── 10. Error: Full IncidenceMatrix : mutate respects colData ──────────────────
     argument is of length zero
     Backtrace:
    
     ── 11. Error: Full IncidenceMatrix : subset respects mat ──────────────────────
     argument is of length zero
     Backtrace:
    
     ── 12. Error: Full IncidenceMatrix : mutate works ─────────────────────────────
     argument is of length zero
     Backtrace:
    
     ── 13. Error: Full IncidenceMatrix : mutate respects nrow ─────────────────────
     argument is of length zero
     Backtrace:
    
     ── 14. Error: Full IncidenceMatrix : mutate respects ncol ─────────────────────
     argument is of length zero
     Backtrace:
    
     ── 15. Error: Full IncidenceMatrix : mutate respects rnames ───────────────────
     argument is of length zero
     Backtrace:
    
     ── 16. Error: Full IncidenceMatrix : mutate respects cnames ───────────────────
     argument is of length zero
     Backtrace:
    
     ── 17. Error: Full IncidenceMatrix : mutate respects metaData ─────────────────
     argument is of length zero
     Backtrace:
    
     ── 18. Error: Full IncidenceMatrix : mutate respects rowData ──────────────────
     argument is of length zero
     Backtrace:
    
     ── 19. Error: Full IncidenceMatrix : mutate respects colData ──────────────────
     argument is of length zero
     Backtrace:
    
     ── 20. Error: Full IncidenceMatrix : subset respects mat ──────────────────────
     argument is of length zero
     Backtrace:
    
     ── 21. Error: Full IncidenceMatrix : addColumns respects mat ──────────────────
     argument is of length zero
     Backtrace:
    
     ── 22. Error: Full IncidenceMatrix : addRows respects mat ─────────────────────
     argument is of length zero
     Backtrace:
    
     ── 23. Error: Full IncidenceMatrix : mutate respects mat ──────────────────────
     argument is of length zero
     Backtrace:
    
     ── 24. Error: Full IncidenceMatrix : diff works ───────────────────────────────
     argument is of length zero
     Backtrace:
    
     ── 25. Error: Full IncidenceMatrix : diff respects ncol ───────────────────────
     argument is of length zero
     Backtrace:
    
     ── 26. Error: Full IncidenceMatrix : diff respects nrow ───────────────────────
     argument is of length zero
     Backtrace:
    
     ── 27. Error: Full IncidenceMatrix : diff respects rnames ─────────────────────
     argument is of length zero
     Backtrace:
    
     ── 28. Error: Full IncidenceMatrix : diff respects cnames ─────────────────────
     argument is of length zero
     Backtrace:
    
     ── 29. Error: Full IncidenceMatrix : diff respects colData ────────────────────
     argument is of length zero
     Backtrace:
    
     ── 30. Error: Full IncidenceMatrix : diff respects mat ────────────────────────
     argument is of length zero
     Backtrace:
    
     ── 31. Error: Full IncidenceMatrix : diff respects metaData ───────────────────
     argument is of length zero
     Backtrace:
    
     ── 32. Error: Full IncidenceMatrix : diff respects rowData ────────────────────
     argument is of length zero
     Backtrace:
    
     ── 33. Error: Full IncidenceMatrix : head respects mat ────────────────────────
     argument is of length zero
     Backtrace:
    
     ── 34. Error: Full IncidenceMatrix : scale works ──────────────────────────────
     argument is of length zero
     Backtrace:
    
     ── 35. Error: Full IncidenceMatrix : scale respects nrow ──────────────────────
     argument is of length zero
     Backtrace:
    
     ── 36. Error: Full IncidenceMatrix : scale respects ncol ──────────────────────
     argument is of length zero
     Backtrace:
    
     ── 37. Error: Full IncidenceMatrix : scale respects cnames ────────────────────
     argument is of length zero
     Backtrace:
    
     ── 38. Error: Full IncidenceMatrix : scale respects rnames ────────────────────
     argument is of length zero
     Backtrace:
    
     ── 39. Error: Full IncidenceMatrix : scale respects colData ───────────────────
     argument is of length zero
     Backtrace:
    
     ── 40. Error: Full IncidenceMatrix : scale respects rowData ───────────────────
     argument is of length zero
     Backtrace:
    
     ── 41. Error: Full IncidenceMatrix : scale respects metaData ──────────────────
     argument is of length zero
     Backtrace:
    
     ── 42. Error: Full IncidenceMatrix : scale respects mat ───────────────────────
     argument is of length zero
     Backtrace:
    
     ── 43. Error: Full SimulatedIncidenceMatrix : Active bindings have correct mode.
     no method or default for coercing "character" to "factor"
     Backtrace:
     1. testthat::expect_equal(first_object, object)
     16. methods::as(tmp_frame$Var1, class(frame$Var1))
    
     ── 44. Error: Full SimulatedIncidenceMatrix : tail respects mat ───────────────
     no method or default for coercing "character" to "factor"
     Backtrace:
     1. testthat::expect_equal(object, firstObject)
     16. methods::as(tmp_frame$Var1, class(frame$Var1))
    
     ── 45. Error: Full SimulatedIncidenceMatrix : tail respects simulations ───────
     no method or default for coercing "character" to "factor"
     Backtrace:
     1. testthat::expect_equal(object, firstObject)
     16. methods::as(tmp_frame$Var1, class(frame$Var1))
    
     ── 46. Error: Full SimulatedIncidenceMatrix : tail respects arr ───────────────
     no method or default for coercing "character" to "factor"
     Backtrace:
     1. testthat::expect_equal(object, firstObject)
     16. methods::as(tmp_frame$Var1, class(frame$Var1))
    
     ── 47. Error: Full SimulatedIncidenceMatrix : mutate works ────────────────────
     no method or default for coercing "character" to "factor"
     Backtrace:
     1. testthat::expect_equal(object, firstObject)
     16. methods::as(tmp_frame$Var1, class(frame$Var1))
    
     ── 48. Error: Full SimulatedIncidenceMatrix : subset respects mat ─────────────
     no method or default for coercing "character" to "factor"
     Backtrace:
     1. testthat::expect_equal(object, firstObject)
     16. methods::as(tmp_frame$Var1, class(frame$Var1))
    
     ── 49. Error: Full SimulatedIncidenceMatrix : subset respects simulations ─────
     no method or default for coercing "character" to "factor"
     Backtrace:
     1. testthat::expect_equal(object, firstObject)
     16. methods::as(tmp_frame$Var1, class(frame$Var1))
    
     ── 50. Error: Full SimulatedIncidenceMatrix : subset respects arr ─────────────
     no method or default for coercing "character" to "factor"
     Backtrace:
     1. testthat::expect_equal(object, firstObject)
     16. methods::as(tmp_frame$Var1, class(frame$Var1))
    
     ── 51. Error: Full SimulatedIncidenceMatrix : mutate works ────────────────────
     no method or default for coercing "character" to "factor"
     Backtrace:
     1. testthat::expect_equal(object, firstObject)
     16. methods::as(tmp_frame$Var1, class(frame$Var1))
    
     ── 52. Error: Full SimulatedIncidenceMatrix : subset respects mat ─────────────
     no method or default for coercing "character" to "factor"
     Backtrace:
     1. testthat::expect_equal(object, firstObject)
     16. methods::as(tmp_frame$Var1, class(frame$Var1))
    
     ── 53. Error: Full SimulatedIncidenceMatrix : subset respects simulations ─────
     no method or default for coercing "character" to "factor"
     Backtrace:
     1. testthat::expect_equal(object, firstObject)
     16. methods::as(tmp_frame$Var1, class(frame$Var1))
    
     ── 54. Error: Full SimulatedIncidenceMatrix : subset respects arr ─────────────
     no method or default for coercing "character" to "factor"
     Backtrace:
     1. testthat::expect_equal(object, firstObject)
     16. methods::as(tmp_frame$Var1, class(frame$Var1))
    
     ── 55. Error: Full SimulatedIncidenceMatrix : addColumns respects mat ─────────
     no method or default for coercing "character" to "factor"
     Backtrace:
     1. testthat::expect_equal(object, firstObject)
     16. methods::as(tmp_frame$Var1, class(frame$Var1))
    
     ── 56. Error: Full SimulatedIncidenceMatrix : addColumns respects simulations ─
     no method or default for coercing "character" to "factor"
     Backtrace:
     1. testthat::expect_equal(object, firstObject)
     16. methods::as(tmp_frame$Var1, class(frame$Var1))
    
     ── 57. Error: Full SimulatedIncidenceMatrix : addColumns respects arr ─────────
     no method or default for coercing "character" to "factor"
     Backtrace:
     1. testthat::expect_equal(object, firstObject)
     16. methods::as(tmp_frame$Var1, class(frame$Var1))
    
     ── 58. Error: Full SimulatedIncidenceMatrix : addRows respects mat ────────────
     no method or default for coercing "character" to "factor"
     Backtrace:
     1. testthat::expect_equal(object, firstObject)
     16. methods::as(tmp_frame$Var1, class(frame$Var1))
    
     ── 59. Error: Full SimulatedIncidenceMatrix : addRows respects simulations ────
     no method or default for coercing "character" to "factor"
     Backtrace:
     1. testthat::expect_equal(object, firstObject)
     16. methods::as(tmp_frame$Var1, class(frame$Var1))
    
     ── 60. Error: Full SimulatedIncidenceMatrix : addRows respects arr ────────────
     no method or default for coercing "character" to "factor"
     Backtrace:
     1. testthat::expect_equal(object, firstObject)
     16. methods::as(tmp_frame$Var1, class(frame$Var1))
    
     ── 61. Error: Full SimulatedIncidenceMatrix : diff works ──────────────────────
     no method or default for coercing "character" to "factor"
     Backtrace:
     1. testthat::expect_equal(object, first_object)
     16. methods::as(tmp_frame$Var1, class(frame$Var1))
    
     ── 62. Error: Full SimulatedIncidenceMatrix : diff respects cnames ────────────
     no method or default for coercing "character" to "factor"
     Backtrace:
     1. testthat::expect_equal(object, first_object)
     16. methods::as(tmp_frame$Var1, class(frame$Var1))
    
     ── 63. Error: Full SimulatedIncidenceMatrix : diff respects ncol ──────────────
     no method or default for coercing "character" to "factor"
     Backtrace:
     1. testthat::expect_equal(object, first_object)
     16. methods::as(tmp_frame$Var1, class(frame$Var1))
    
     ── 64. Error: Full SimulatedIncidenceMatrix : diff respects nsim ──────────────
     no method or default for coercing "character" to "factor"
     Backtrace:
     1. testthat::expect_equal(object, first_object)
     16. methods::as(tmp_frame$Var1, class(frame$Var1))
    
     ── 65. Error: Full SimulatedIncidenceMatrix : diff respects nrow ──────────────
     no method or default for coercing "character" to "factor"
     Backtrace:
     1. testthat::expect_equal(object, first_object)
     16. methods::as(tmp_frame$Var1, class(frame$Var1))
    
     ── 66. Error: Full SimulatedIncidenceMatrix : diff respects rnames ────────────
     no method or default for coercing "character" to "factor"
     Backtrace:
     1. testthat::expect_equal(object, first_object)
     16. methods::as(tmp_frame$Var1, class(frame$Var1))
    
     ── 67. Error: Full SimulatedIncidenceMatrix : diff respects colData ───────────
     no method or default for coercing "character" to "factor"
     Backtrace:
     1. testthat::expect_equal(object, first_object)
     16. methods::as(tmp_frame$Var1, class(frame$Var1))
    
     ── 68. Error: Full SimulatedIncidenceMatrix : diff respects mat ───────────────
     no method or default for coercing "character" to "factor"
     Backtrace:
     1. testthat::expect_equal(object, first_object)
     16. methods::as(tmp_frame$Var1, class(frame$Var1))
    
     ── 69. Error: Full SimulatedIncidenceMatrix : diff respects simulations ───────
     no method or default for coercing "character" to "factor"
     Backtrace:
     1. testthat::expect_equal(object, first_object)
     16. methods::as(tmp_frame$Var1, class(frame$Var1))
    
     ── 70. Error: Full SimulatedIncidenceMatrix : diff respects arr ───────────────
     no method or default for coercing "character" to "factor"
     Backtrace:
     1. testthat::expect_equal(object, first_object)
     16. methods::as(tmp_frame$Var1, class(frame$Var1))
    
     ── 71. Error: Full SimulatedIncidenceMatrix : diff respects metaData ──────────
     no method or default for coercing "character" to "factor"
     Backtrace:
     1. testthat::expect_equal(object, first_object)
     16. methods::as(tmp_frame$Var1, class(frame$Var1))
    
     ── 72. Error: Full SimulatedIncidenceMatrix : diff respects rowData ───────────
     no method or default for coercing "character" to "factor"
     Backtrace:
     1. testthat::expect_equal(object, first_object)
     16. methods::as(tmp_frame$Var1, class(frame$Var1))
    
     ── 73. Error: Full SimulatedIncidenceMatrix : head respects mat ───────────────
     no method or default for coercing "character" to "factor"
     Backtrace:
     1. testthat::expect_equal(object, firstObject)
     16. methods::as(tmp_frame$Var1, class(frame$Var1))
    
     ── 74. Error: Full SimulatedIncidenceMatrix : head respects simulations ───────
     no method or default for coercing "character" to "factor"
     Backtrace:
     1. testthat::expect_equal(object, firstObject)
     16. methods::as(tmp_frame$Var1, class(frame$Var1))
    
     ── 75. Error: Full SimulatedIncidenceMatrix : head respects arr ───────────────
     no method or default for coercing "character" to "factor"
     Backtrace:
     1. testthat::expect_equal(object, firstObject)
     16. methods::as(tmp_frame$Var1, class(frame$Var1))
    
     ── 76. Error: Full SimulatedIncidenceMatrix : scale works ─────────────────────
     no method or default for coercing "character" to "factor"
     Backtrace:
     1. testthat::expect_equal(first_object, object)
     16. methods::as(tmp_frame$Var1, class(frame$Var1))
    
     ── 77. Error: Full SimulatedIncidenceMatrix : scale respects nrow ─────────────
     no method or default for coercing "character" to "factor"
     Backtrace:
     1. testthat::expect_equal(first_object, object)
     16. methods::as(tmp_frame$Var1, class(frame$Var1))
    
     ── 78. Error: Full SimulatedIncidenceMatrix : scale respects ncol ─────────────
     no method or default for coercing "character" to "factor"
     Backtrace:
     1. testthat::expect_equal(first_object, object)
     16. methods::as(tmp_frame$Var1, class(frame$Var1))
    
     ── 79. Error: Full SimulatedIncidenceMatrix : scale respects nsim ─────────────
     no method or default for coercing "character" to "factor"
     Backtrace:
     1. testthat::expect_equal(first_object, object)
     16. methods::as(tmp_frame$Var1, class(frame$Var1))
    
     ── 80. Error: Full SimulatedIncidenceMatrix : scale respects cnames ───────────
     no method or default for coercing "character" to "factor"
     Backtrace:
     1. testthat::expect_equal(first_object, object)
     16. methods::as(tmp_frame$Var1, class(frame$Var1))
    
     ── 81. Error: Full SimulatedIncidenceMatrix : scale respects rnames ───────────
     no method or default for coercing "character" to "factor"
     Backtrace:
     1. testthat::expect_equal(first_object, object)
     16. methods::as(tmp_frame$Var1, class(frame$Var1))
    
     ── 82. Error: Full SimulatedIncidenceMatrix : scale respects colData ──────────
     no method or default for coercing "character" to "factor"
     Backtrace:
     1. testthat::expect_equal(first_object, object)
     16. methods::as(tmp_frame$Var1, class(frame$Var1))
    
     ── 83. Error: Full SimulatedIncidenceMatrix : scale respects rowData ──────────
     no method or default for coercing "character" to "factor"
     Backtrace:
     1. testthat::expect_equal(first_object, object)
     16. methods::as(tmp_frame$Var1, class(frame$Var1))
    
     ── 84. Error: Full SimulatedIncidenceMatrix : scale respects metaData ─────────
     no method or default for coercing "character" to "factor"
     Backtrace:
     1. testthat::expect_equal(first_object, object)
     16. methods::as(tmp_frame$Var1, class(frame$Var1))
    
     ── 85. Error: Full SimulatedIncidenceMatrix : scale respects mat ──────────────
     no method or default for coercing "character" to "factor"
     Backtrace:
     1. testthat::expect_equal(first_object, object)
     16. methods::as(tmp_frame$Var1, class(frame$Var1))
    
     ── 86. Error: Full SimulatedIncidenceMatrix : scale respects simulations ──────
     no method or default for coercing "character" to "factor"
     Backtrace:
     1. testthat::expect_equal(first_object, object)
     16. methods::as(tmp_frame$Var1, class(frame$Var1))
    
     ── 87. Error: Full SimulatedIncidenceMatrix : scale respects arr ──────────────
     no method or default for coercing "character" to "factor"
     Backtrace:
     1. testthat::expect_equal(first_object, object)
     16. methods::as(tmp_frame$Var1, class(frame$Var1))
    
     ── 88. Error: Full SimulatedIncidenceMatrix : addError works ──────────────────
     no method or default for coercing "character" to "factor"
     Backtrace:
     1. testthat::expect_equal(first_object, object)
     16. methods::as(tmp_frame$Var1, class(frame$Var1))
    
     ── 89. Error: Full SimulatedIncidenceMatrix : addError respects ncol ──────────
     no method or default for coercing "character" to "factor"
     Backtrace:
     1. testthat::expect_equal(first_object, object)
     16. methods::as(tmp_frame$Var1, class(frame$Var1))
    
     ── 90. Error: Full SimulatedIncidenceMatrix : addError respects nrow ──────────
     no method or default for coercing "character" to "factor"
     Backtrace:
     1. testthat::expect_equal(first_object, object)
     16. methods::as(tmp_frame$Var1, class(frame$Var1))
    
     ── 91. Error: Full SimulatedIncidenceMatrix : addError respects ncol ──────────
     no method or default for coercing "character" to "factor"
     Backtrace:
     1. testthat::expect_equal(first_object, object)
     16. methods::as(tmp_frame$Var1, class(frame$Var1))
    
     ── 92. Error: Full SimulatedIncidenceMatrix : addError respects cnames ────────
     no method or default for coercing "character" to "factor"
     Backtrace:
     1. testthat::expect_equal(first_object, object)
     16. methods::as(tmp_frame$Var1, class(frame$Var1))
    
     ── 93. Error: Full SimulatedIncidenceMatrix : addError respects rnames ────────
     no method or default for coercing "character" to "factor"
     Backtrace:
     1. testthat::expect_equal(first_object, object)
     16. methods::as(tmp_frame$Var1, class(frame$Var1))
    
     ── 94. Error: Full SimulatedIncidenceMatrix : addError respects colData ───────
     no method or default for coercing "character" to "factor"
     Backtrace:
     1. testthat::expect_equal(first_object, object)
     16. methods::as(tmp_frame$Var1, class(frame$Var1))
    
     ── 95. Error: Full SimulatedIncidenceMatrix : addError respects rowData ───────
     no method or default for coercing "character" to "factor"
     Backtrace:
     1. testthat::expect_equal(first_object, object)
     16. methods::as(tmp_frame$Var1, class(frame$Var1))
    
     ── 96. Error: Full SimulatedIncidenceMatrix : addError respects metaData ──────
     no method or default for coercing "character" to "factor"
     Backtrace:
     1. testthat::expect_equal(first_object, object)
     16. methods::as(tmp_frame$Var1, class(frame$Var1))
    
     ── 97. Error: Full SimulatedIncidenceMatrix : addError respects metaData ──────
     no method or default for coercing "character" to "factor"
     Backtrace:
     1. testthat::expect_equal(first_object, object)
     16. methods::as(tmp_frame$Var1, class(frame$Var1))
    
     ── 98. Error: Full SimulatedIncidenceMatrix : addError respects nsim ──────────
     no method or default for coercing "character" to "factor"
     Backtrace:
     1. testthat::expect_equal(first_object, object)
     16. methods::as(tmp_frame$Var1, class(frame$Var1))
    
     ── 99. Error: Full SimulatedIncidenceMatrix : addError respects nsim ──────────
     no method or default for coercing "character" to "factor"
     Backtrace:
     1. testthat::expect_equal(first_object, object)
     16. methods::as(tmp_frame$Var1, class(frame$Var1))
    
     ── 100. Error: Full SimulatedIncidenceMatrix : addError respects mat ──────────
     no method or default for coercing "character" to "factor"
     Backtrace:
     1. testthat::expect_equal(first_object, object)
     16. methods::as(tmp_frame$Var1, class(frame$Var1))
    
     ── 101. Error: Full SimulatedIncidenceMatrix : addError respects simulations ──
     no method or default for coercing "character" to "factor"
     Backtrace:
     1. testthat::expect_equal(first_object, object)
     16. methods::as(tmp_frame$Var1, class(frame$Var1))
    
     ── 102. Error: Full SimulatedIncidenceMatrix : addError respects arr ──────────
     no method or default for coercing "character" to "factor"
     Backtrace:
     1. testthat::expect_equal(first_object, object)
     16. methods::as(tmp_frame$Var1, class(frame$Var1))
    
     ── 103. Error: Full SimulatedIncidenceMatrix : summarize works ────────────────
     no method or default for coercing "character" to "factor"
     Backtrace:
     1. testthat::expect_equal(first_object, object)
     16. methods::as(tmp_frame$Var1, class(frame$Var1))
    
     ── 104. Error: List SimulatedIncidenceMatrix : Active bindings have correct mode
     no method or default for coercing "character" to "factor"
     Backtrace:
     1. testthat::expect_equal(first_object, object)
     16. methods::as(tmp_frame$Var1, class(frame$Var1))
    
     ── 105. Error: List SimulatedIncidenceMatrix : tail respects mat ──────────────
     no method or default for coercing "character" to "factor"
     Backtrace:
     1. testthat::expect_equal(object, firstObject)
     16. methods::as(tmp_frame$Var1, class(frame$Var1))
    
     ── 106. Error: List SimulatedIncidenceMatrix : tail respects simulations ──────
     no method or default for coercing "character" to "factor"
     Backtrace:
     1. testthat::expect_equal(object, firstObject)
     16. methods::as(tmp_frame$Var1, class(frame$Var1))
    
     ── 107. Error: List SimulatedIncidenceMatrix : tail respects arr ──────────────
     no method or default for coercing "character" to "factor"
     Backtrace:
     1. testthat::expect_equal(object, firstObject)
     16. methods::as(tmp_frame$Var1, class(frame$Var1))
    
     ── 108. Error: List SimulatedIncidenceMatrix : mutate works ───────────────────
     no method or default for coercing "character" to "factor"
     Backtrace:
     1. testthat::expect_equal(object, firstObject)
     16. methods::as(tmp_frame$Var1, class(frame$Var1))
    
     ── 109. Error: List SimulatedIncidenceMatrix : subset respects mat ────────────
     no method or default for coercing "character" to "factor"
     Backtrace:
     1. testthat::expect_equal(object, firstObject)
     16. methods::as(tmp_frame$Var1, class(frame$Var1))
    
     ── 110. Error: List SimulatedIncidenceMatrix : subset respects simulations ────
     no method or default for coercing "character" to "factor"
     Backtrace:
     1. testthat::expect_equal(object, firstObject)
     16. methods::as(tmp_frame$Var1, class(frame$Var1))
    
     ── 111. Error: List SimulatedIncidenceMatrix : subset respects arr ────────────
     no method or default for coercing "character" to "factor"
     Backtrace:
     1. testthat::expect_equal(object, firstObject)
     16. methods::as(tmp_frame$Var1, class(frame$Var1))
    
     ── 112. Error: List SimulatedIncidenceMatrix : mutate works ───────────────────
     no method or default for coercing "character" to "factor"
     Backtrace:
     1. testthat::expect_equal(object, firstObject)
     16. methods::as(tmp_frame$Var1, class(frame$Var1))
    
     ── 113. Error: List SimulatedIncidenceMatrix : subset respects mat ────────────
     no method or default for coercing "character" to "factor"
     Backtrace:
     1. testthat::expect_equal(object, firstObject)
     16. methods::as(tmp_frame$Var1, class(frame$Var1))
    
     ── 114. Error: List SimulatedIncidenceMatrix : subset respects simulations ────
     no method or default for coercing "character" to "factor"
     Backtrace:
     1. testthat::expect_equal(object, firstObject)
     16. methods::as(tmp_frame$Var1, class(frame$Var1))
    
     ── 115. Error: List SimulatedIncidenceMatrix : subset respects arr ────────────
     no method or default for coercing "character" to "factor"
     Backtrace:
     1. testthat::expect_equal(object, firstObject)
     16. methods::as(tmp_frame$Var1, class(frame$Var1))
    
     ── 116. Error: List SimulatedIncidenceMatrix : addColumns respects mat ────────
     no method or default for coercing "character" to "factor"
     Backtrace:
     1. testthat::expect_equal(object, firstObject)
     16. methods::as(tmp_frame$Var1, class(frame$Var1))
    
     ── 117. Error: List SimulatedIncidenceMatrix : addColumns respects simulations
     no method or default for coercing "character" to "factor"
     Backtrace:
     1. testthat::expect_equal(object, firstObject)
     16. methods::as(tmp_frame$Var1, class(frame$Var1))
    
     ── 118. Error: List SimulatedIncidenceMatrix : addColumns respects arr ────────
     no method or default for coercing "character" to "factor"
     Backtrace:
     1. testthat::expect_equal(object, firstObject)
     16. methods::as(tmp_frame$Var1, class(frame$Var1))
    
     ── 119. Error: List SimulatedIncidenceMatrix : addRows respects mat ───────────
     no method or default for coercing "character" to "factor"
     Backtrace:
     1. testthat::expect_equal(object, firstObject)
     16. methods::as(tmp_frame$Var1, class(frame$Var1))
    
     ── 120. Error: List SimulatedIncidenceMatrix : addRows respects simulations ───
     no method or default for coercing "character" to "factor"
     Backtrace:
     1. testthat::expect_equal(object, firstObject)
     16. methods::as(tmp_frame$Var1, class(frame$Var1))
    
     ── 121. Error: List SimulatedIncidenceMatrix : addRows respects arr ───────────
     no method or default for coercing "character" to "factor"
     Backtrace:
     1. testthat::expect_equal(object, firstObject)
     16. methods::as(tmp_frame$Var1, class(frame$Var1))
    
     ── 122. Error: List SimulatedIncidenceMatrix : diff works ─────────────────────
     no method or default for coercing "character" to "factor"
     Backtrace:
     1. testthat::expect_equal(object, first_object)
     16. methods::as(tmp_frame$Var1, class(frame$Var1))
    
     ── 123. Error: List SimulatedIncidenceMatrix : diff respects cnames ───────────
     no method or default for coercing "character" to "factor"
     Backtrace:
     1. testthat::expect_equal(object, first_object)
     16. methods::as(tmp_frame$Var1, class(frame$Var1))
    
     ── 124. Error: List SimulatedIncidenceMatrix : diff respects ncol ─────────────
     no method or default for coercing "character" to "factor"
     Backtrace:
     1. testthat::expect_equal(object, first_object)
     16. methods::as(tmp_frame$Var1, class(frame$Var1))
    
     ── 125. Error: List SimulatedIncidenceMatrix : diff respects nsim ─────────────
     no method or default for coercing "character" to "factor"
     Backtrace:
     1. testthat::expect_equal(object, first_object)
     16. methods::as(tmp_frame$Var1, class(frame$Var1))
    
     ── 126. Error: List SimulatedIncidenceMatrix : diff respects nrow ─────────────
     no method or default for coercing "character" to "factor"
     Backtrace:
     1. testthat::expect_equal(object, first_object)
     16. methods::as(tmp_frame$Var1, class(frame$Var1))
    
     ── 127. Error: List SimulatedIncidenceMatrix : diff respects rnames ───────────
     no method or default for coercing "character" to "factor"
     Backtrace:
     1. testthat::expect_equal(object, first_object)
     16. methods::as(tmp_frame$Var1, class(frame$Var1))
    
     ── 128. Error: List SimulatedIncidenceMatrix : diff respects colData ──────────
     no method or default for coercing "character" to "factor"
     Backtrace:
     1. testthat::expect_equal(object, first_object)
     16. methods::as(tmp_frame$Var1, class(frame$Var1))
    
     ── 129. Error: List SimulatedIncidenceMatrix : diff respects mat ──────────────
     no method or default for coercing "character" to "factor"
     Backtrace:
     1. testthat::expect_equal(object, first_object)
     16. methods::as(tmp_frame$Var1, class(frame$Var1))
    
     ── 130. Error: List SimulatedIncidenceMatrix : diff respects simulations ──────
     no method or default for coercing "character" to "factor"
     Backtrace:
     1. testthat::expect_equal(object, first_object)
     16. methods::as(tmp_frame$Var1, class(frame$Var1))
    
     ── 131. Error: List SimulatedIncidenceMatrix : diff respects arr ──────────────
     no method or default for coercing "character" to "factor"
     Backtrace:
     1. testthat::expect_equal(object, first_object)
     16. methods::as(tmp_frame$Var1, class(frame$Var1))
    
     ── 132. Error: List SimulatedIncidenceMatrix : diff respects metaData ─────────
     no method or default for coercing "character" to "factor"
     Backtrace:
     1. testthat::expect_equal(object, first_object)
     16. methods::as(tmp_frame$Var1, class(frame$Var1))
    
     ── 133. Error: List SimulatedIncidenceMatrix : diff respects rowData ──────────
     no method or default for coercing "character" to "factor"
     Backtrace:
     1. testthat::expect_equal(object, first_object)
     16. methods::as(tmp_frame$Var1, class(frame$Var1))
    
     ── 134. Error: List SimulatedIncidenceMatrix : head respects mat ──────────────
     no method or default for coercing "character" to "factor"
     Backtrace:
     1. testthat::expect_equal(object, firstObject)
     16. methods::as(tmp_frame$Var1, class(frame$Var1))
    
     ── 135. Error: List SimulatedIncidenceMatrix : head respects simulations ──────
     no method or default for coercing "character" to "factor"
     Backtrace:
     1. testthat::expect_equal(object, firstObject)
     16. methods::as(tmp_frame$Var1, class(frame$Var1))
    
     ── 136. Error: List SimulatedIncidenceMatrix : head respects arr ──────────────
     no method or default for coercing "character" to "factor"
     Backtrace:
     1. testthat::expect_equal(object, firstObject)
     16. methods::as(tmp_frame$Var1, class(frame$Var1))
    
     ── 137. Error: List SimulatedIncidenceMatrix : scale works ────────────────────
     no method or default for coercing "character" to "factor"
     Backtrace:
     1. testthat::expect_equal(first_object, object)
     16. methods::as(tmp_frame$Var1, class(frame$Var1))
    
     ── 138. Error: List SimulatedIncidenceMatrix : scale respects nrow ────────────
     no method or default for coercing "character" to "factor"
     Backtrace:
     1. testthat::expect_equal(first_object, object)
     16. methods::as(tmp_frame$Var1, class(frame$Var1))
    
     ── 139. Error: List SimulatedIncidenceMatrix : scale respects ncol ────────────
     no method or default for coercing "character" to "factor"
     Backtrace:
     1. testthat::expect_equal(first_object, object)
     16. methods::as(tmp_frame$Var1, class(frame$Var1))
    
     ── 140. Error: List SimulatedIncidenceMatrix : scale respects nsim ────────────
     no method or default for coercing "character" to "factor"
     Backtrace:
     1. testthat::expect_equal(first_object, object)
     16. methods::as(tmp_frame$Var1, class(frame$Var1))
    
     ── 141. Error: List SimulatedIncidenceMatrix : scale respects cnames ──────────
     no method or default for coercing "character" to "factor"
     Backtrace:
     1. testthat::expect_equal(first_object, object)
     16. methods::as(tmp_frame$Var1, class(frame$Var1))
    
     ── 142. Error: List SimulatedIncidenceMatrix : scale respects rnames ──────────
     no method or default for coercing "character" to "factor"
     Backtrace:
     1. testthat::expect_equal(first_object, object)
     16. methods::as(tmp_frame$Var1, class(frame$Var1))
    
     ── 143. Error: List SimulatedIncidenceMatrix : scale respects colData ─────────
     no method or default for coercing "character" to "factor"
     Backtrace:
     1. testthat::expect_equal(first_object, object)
     16. methods::as(tmp_frame$Var1, class(frame$Var1))
    
     ── 144. Error: List SimulatedIncidenceMatrix : scale respects rowData ─────────
     no method or default for coercing "character" to "factor"
     Backtrace:
     1. testthat::expect_equal(first_object, object)
     16. methods::as(tmp_frame$Var1, class(frame$Var1))
    
     ── 145. Error: List SimulatedIncidenceMatrix : scale respects metaData ────────
     no method or default for coercing "character" to "factor"
     Backtrace:
     1. testthat::expect_equal(first_object, object)
     16. methods::as(tmp_frame$Var1, class(frame$Var1))
    
     ── 146. Error: List SimulatedIncidenceMatrix : scale respects mat ─────────────
     no method or default for coercing "character" to "factor"
     Backtrace:
     1. testthat::expect_equal(first_object, object)
     16. methods::as(tmp_frame$Var1, class(frame$Var1))
    
     ── 147. Error: List SimulatedIncidenceMatrix : scale respects simulations ─────
     no method or default for coercing "character" to "factor"
     Backtrace:
     1. testthat::expect_equal(first_object, object)
     16. methods::as(tmp_frame$Var1, class(frame$Var1))
    
     ── 148. Error: List SimulatedIncidenceMatrix : scale respects arr ─────────────
     no method or default for coercing "character" to "factor"
     Backtrace:
     1. testthat::expect_equal(first_object, object)
     16. methods::as(tmp_frame$Var1, class(frame$Var1))
    
     ── 149. Error: List SimulatedIncidenceMatrix : addError works ─────────────────
     no method or default for coercing "character" to "factor"
     Backtrace:
     1. testthat::expect_equal(first_object, object)
     16. methods::as(tmp_frame$Var1, class(frame$Var1))
    
     ── 150. Error: List SimulatedIncidenceMatrix : addError respects ncol ─────────
     no method or default for coercing "character" to "factor"
     Backtrace:
     1. testthat::expect_equal(first_object, object)
     16. methods::as(tmp_frame$Var1, class(frame$Var1))
    
     ── 151. Error: List SimulatedIncidenceMatrix : addError respects nrow ─────────
     no method or default for coercing "character" to "factor"
     Backtrace:
     1. testthat::expect_equal(first_object, object)
     16. methods::as(tmp_frame$Var1, class(frame$Var1))
    
     ── 152. Error: List SimulatedIncidenceMatrix : addError respects ncol ─────────
     no method or default for coercing "character" to "factor"
     Backtrace:
     1. testthat::expect_equal(first_object, object)
     16. methods::as(tmp_frame$Var1, class(frame$Var1))
    
     ── 153. Error: List SimulatedIncidenceMatrix : addError respects cnames ───────
     no method or default for coercing "character" to "factor"
     Backtrace:
     1. testthat::expect_equal(first_object, object)
     16. methods::as(tmp_frame$Var1, class(frame$Var1))
    
     ── 154. Error: List SimulatedIncidenceMatrix : addError respects rnames ───────
     no method or default for coercing "character" to "factor"
     Backtrace:
     1. testthat::expect_equal(first_object, object)
     16. methods::as(tmp_frame$Var1, class(frame$Var1))
    
     ── 155. Error: List SimulatedIncidenceMatrix : addError respects colData ──────
     no method or default for coercing "character" to "factor"
     Backtrace:
     1. testthat::expect_equal(first_object, object)
     16. methods::as(tmp_frame$Var1, class(frame$Var1))
    
     ── 156. Error: List SimulatedIncidenceMatrix : addError respects rowData ──────
     no method or default for coercing "character" to "factor"
     Backtrace:
     1. testthat::expect_equal(first_object, object)
     16. methods::as(tmp_frame$Var1, class(frame$Var1))
    
     ── 157. Error: List SimulatedIncidenceMatrix : addError respects metaData ─────
     no method or default for coercing "character" to "factor"
     Backtrace:
     1. testthat::expect_equal(first_object, object)
     16. methods::as(tmp_frame$Var1, class(frame$Var1))
    
     ── 158. Error: List SimulatedIncidenceMatrix : addError respects metaData ─────
     no method or default for coercing "character" to "factor"
     Backtrace:
     1. testthat::expect_equal(first_object, object)
     16. methods::as(tmp_frame$Var1, class(frame$Var1))
    
     ── 159. Error: List SimulatedIncidenceMatrix : addError respects nsim ─────────
     no method or default for coercing "character" to "factor"
     Backtrace:
     1. testthat::expect_equal(first_object, object)
     16. methods::as(tmp_frame$Var1, class(frame$Var1))
    
     ── 160. Error: List SimulatedIncidenceMatrix : addError respects nsim ─────────
     no method or default for coercing "character" to "factor"
     Backtrace:
     1. testthat::expect_equal(first_object, object)
     16. methods::as(tmp_frame$Var1, class(frame$Var1))
    
     ── 161. Error: List SimulatedIncidenceMatrix : addError respects mat ──────────
     no method or default for coercing "character" to "factor"
     Backtrace:
     1. testthat::expect_equal(first_object, object)
     16. methods::as(tmp_frame$Var1, class(frame$Var1))
    
     ── 162. Error: List SimulatedIncidenceMatrix : addError respects simulations ──
     no method or default for coercing "character" to "factor"
     Backtrace:
     1. testthat::expect_equal(first_object, object)
     16. methods::as(tmp_frame$Var1, class(frame$Var1))
    
     ── 163. Error: List SimulatedIncidenceMatrix : addError respects arr ──────────
     no method or default for coercing "character" to "factor"
     Backtrace:
     1. testthat::expect_equal(first_object, object)
     16. methods::as(tmp_frame$Var1, class(frame$Var1))
    
     ── 164. Error: List SimulatedIncidenceMatrix : summarize works ────────────────
     no method or default for coercing "character" to "factor"
     Backtrace:
     1. testthat::expect_equal(first_object, object)
     16. methods::as(tmp_frame$Var1, class(frame$Var1))
    
     ── 165. Error: Full IncidenceForecast : mean works ────────────────────────────
     no method or default for coercing "character" to "factor"
     Backtrace:
     1. testthat::expect_that(...)
     20. methods::as(tmp_frame$Var1, class(frame$Var1))
    
     ── 166. Error: Full IncidenceForecast : median works ──────────────────────────
     no method or default for coercing "character" to "factor"
     Backtrace:
     1. testthat::expect_that(...)
     20. methods::as(tmp_frame$Var1, class(frame$Var1))
    
     ── 167. Error: Full IncidenceForecast : Inherited Methods don't change object ─
     no method or default for coercing "character" to "factor"
     Backtrace:
     1. equivalence(first_object)(object)
     19. methods::as(tmp_frame$Var1, class(frame$Var1))
    
     ── 168. Error: Full IncidenceForecast : sample works ──────────────────────────
     no method or default for coercing "character" to "factor"
     Backtrace:
     1. testthat::expect_that(first_object, equals(object))
     28. methods::as(tmp_frame$Var1, class(frame$Var1))
    
     ══ testthat results ═══════════════════════════════════════════════════════════
     [ OK: 10173 | SKIPPED: 207 | WARNINGS: 123 | FAILED: 168 ]
     1. Error: Full IncidenceMatrix : Active bindings have correct mode.
     2. Error: Full IncidenceMatrix : tail respects mat
     3. Error: Full IncidenceMatrix : mutate works
     4. Error: Full IncidenceMatrix : mutate respects nrow
     5. Error: Full IncidenceMatrix : mutate respects ncol
     6. Error: Full IncidenceMatrix : mutate respects rnames
     7. Error: Full IncidenceMatrix : mutate respects cnames
     8. Error: Full IncidenceMatrix : mutate respects metaData
     9. Error: Full IncidenceMatrix : mutate respects rowData
     1. ...
    
     Error: testthat unit tests failed
     Execution halted
Flavor: r-devel-linux-x86_64-debian-gcc

Version: 0.10.3
Check: tests
Result: ERROR
     Running ‘testthat.R’ [256s/305s]
    Running the tests in ‘tests/testthat.R’ failed.
    Complete output:
     > library(testthat)
     > test_check("ForecastFramework")
     Loading required package: ForecastFramework
     Loading required package: R6
     ── 1. Error: Full IncidenceMatrix : Active bindings have correct mode. ────────
     argument is of length zero
     Backtrace:
    
     ── 2. Error: Full IncidenceMatrix : tail respects mat ─────────────────────────
     argument is of length zero
     Backtrace:
    
     ── 3. Error: Full IncidenceMatrix : mutate works ──────────────────────────────
     argument is of length zero
     Backtrace:
    
     ── 4. Error: Full IncidenceMatrix : mutate respects nrow ──────────────────────
     argument is of length zero
     Backtrace:
    
     ── 5. Error: Full IncidenceMatrix : mutate respects ncol ──────────────────────
     argument is of length zero
     Backtrace:
    
     ── 6. Error: Full IncidenceMatrix : mutate respects rnames ────────────────────
     argument is of length zero
     Backtrace:
    
     ── 7. Error: Full IncidenceMatrix : mutate respects cnames ────────────────────
     argument is of length zero
     Backtrace:
    
     ── 8. Error: Full IncidenceMatrix : mutate respects metaData ──────────────────
     argument is of length zero
     Backtrace:
    
     ── 9. Error: Full IncidenceMatrix : mutate respects rowData ───────────────────
     argument is of length zero
     Backtrace:
    
     ── 10. Error: Full IncidenceMatrix : mutate respects colData ──────────────────
     argument is of length zero
     Backtrace:
    
     ── 11. Error: Full IncidenceMatrix : subset respects mat ──────────────────────
     argument is of length zero
     Backtrace:
    
     ── 12. Error: Full IncidenceMatrix : mutate works ─────────────────────────────
     argument is of length zero
     Backtrace:
    
     ── 13. Error: Full IncidenceMatrix : mutate respects nrow ─────────────────────
     argument is of length zero
     Backtrace:
    
     ── 14. Error: Full IncidenceMatrix : mutate respects ncol ─────────────────────
     argument is of length zero
     Backtrace:
    
     ── 15. Error: Full IncidenceMatrix : mutate respects rnames ───────────────────
     argument is of length zero
     Backtrace:
    
     ── 16. Error: Full IncidenceMatrix : mutate respects cnames ───────────────────
     argument is of length zero
     Backtrace:
    
     ── 17. Error: Full IncidenceMatrix : mutate respects metaData ─────────────────
     argument is of length zero
     Backtrace:
    
     ── 18. Error: Full IncidenceMatrix : mutate respects rowData ──────────────────
     argument is of length zero
     Backtrace:
    
     ── 19. Error: Full IncidenceMatrix : mutate respects colData ──────────────────
     argument is of length zero
     Backtrace:
    
     ── 20. Error: Full IncidenceMatrix : subset respects mat ──────────────────────
     argument is of length zero
     Backtrace:
    
     ── 21. Error: Full IncidenceMatrix : addColumns respects mat ──────────────────
     argument is of length zero
     Backtrace:
    
     ── 22. Error: Full IncidenceMatrix : addRows respects mat ─────────────────────
     argument is of length zero
     Backtrace:
    
     ── 23. Error: Full IncidenceMatrix : mutate respects mat ──────────────────────
     argument is of length zero
     Backtrace:
    
     ── 24. Error: Full IncidenceMatrix : diff works ───────────────────────────────
     argument is of length zero
     Backtrace:
    
     ── 25. Error: Full IncidenceMatrix : diff respects ncol ───────────────────────
     argument is of length zero
     Backtrace:
    
     ── 26. Error: Full IncidenceMatrix : diff respects nrow ───────────────────────
     argument is of length zero
     Backtrace:
    
     ── 27. Error: Full IncidenceMatrix : diff respects rnames ─────────────────────
     argument is of length zero
     Backtrace:
    
     ── 28. Error: Full IncidenceMatrix : diff respects cnames ─────────────────────
     argument is of length zero
     Backtrace:
    
     ── 29. Error: Full IncidenceMatrix : diff respects colData ────────────────────
     argument is of length zero
     Backtrace:
    
     ── 30. Error: Full IncidenceMatrix : diff respects mat ────────────────────────
     argument is of length zero
     Backtrace:
    
     ── 31. Error: Full IncidenceMatrix : diff respects metaData ───────────────────
     argument is of length zero
     Backtrace:
    
     ── 32. Error: Full IncidenceMatrix : diff respects rowData ────────────────────
     argument is of length zero
     Backtrace:
    
     ── 33. Error: Full IncidenceMatrix : head respects mat ────────────────────────
     argument is of length zero
     Backtrace:
    
     ── 34. Error: Full IncidenceMatrix : scale works ──────────────────────────────
     argument is of length zero
     Backtrace:
    
     ── 35. Error: Full IncidenceMatrix : scale respects nrow ──────────────────────
     argument is of length zero
     Backtrace:
    
     ── 36. Error: Full IncidenceMatrix : scale respects ncol ──────────────────────
     argument is of length zero
     Backtrace:
    
     ── 37. Error: Full IncidenceMatrix : scale respects cnames ────────────────────
     argument is of length zero
     Backtrace:
    
     ── 38. Error: Full IncidenceMatrix : scale respects rnames ────────────────────
     argument is of length zero
     Backtrace:
    
     ── 39. Error: Full IncidenceMatrix : scale respects colData ───────────────────
     argument is of length zero
     Backtrace:
    
     ── 40. Error: Full IncidenceMatrix : scale respects rowData ───────────────────
     argument is of length zero
     Backtrace:
    
     ── 41. Error: Full IncidenceMatrix : scale respects metaData ──────────────────
     argument is of length zero
     Backtrace:
    
     ── 42. Error: Full IncidenceMatrix : scale respects mat ───────────────────────
     argument is of length zero
     Backtrace:
    
     ── 43. Error: Full SimulatedIncidenceMatrix : Active bindings have correct mode.
     no method or default for coercing "character" to "factor"
     Backtrace:
     1. testthat::expect_equal(first_object, object)
     16. methods::as(tmp_frame$Var1, class(frame$Var1))
    
     ── 44. Error: Full SimulatedIncidenceMatrix : tail respects mat ───────────────
     no method or default for coercing "character" to "factor"
     Backtrace:
     1. testthat::expect_equal(object, firstObject)
     16. methods::as(tmp_frame$Var1, class(frame$Var1))
    
     ── 45. Error: Full SimulatedIncidenceMatrix : tail respects simulations ───────
     no method or default for coercing "character" to "factor"
     Backtrace:
     1. testthat::expect_equal(object, firstObject)
     16. methods::as(tmp_frame$Var1, class(frame$Var1))
    
     ── 46. Error: Full SimulatedIncidenceMatrix : tail respects arr ───────────────
     no method or default for coercing "character" to "factor"
     Backtrace:
     1. testthat::expect_equal(object, firstObject)
     16. methods::as(tmp_frame$Var1, class(frame$Var1))
    
     ── 47. Error: Full SimulatedIncidenceMatrix : mutate works ────────────────────
     no method or default for coercing "character" to "factor"
     Backtrace:
     1. testthat::expect_equal(object, firstObject)
     16. methods::as(tmp_frame$Var1, class(frame$Var1))
    
     ── 48. Error: Full SimulatedIncidenceMatrix : subset respects mat ─────────────
     no method or default for coercing "character" to "factor"
     Backtrace:
     1. testthat::expect_equal(object, firstObject)
     16. methods::as(tmp_frame$Var1, class(frame$Var1))
    
     ── 49. Error: Full SimulatedIncidenceMatrix : subset respects simulations ─────
     no method or default for coercing "character" to "factor"
     Backtrace:
     1. testthat::expect_equal(object, firstObject)
     16. methods::as(tmp_frame$Var1, class(frame$Var1))
    
     ── 50. Error: Full SimulatedIncidenceMatrix : subset respects arr ─────────────
     no method or default for coercing "character" to "factor"
     Backtrace:
     1. testthat::expect_equal(object, firstObject)
     16. methods::as(tmp_frame$Var1, class(frame$Var1))
    
     ── 51. Error: Full SimulatedIncidenceMatrix : mutate works ────────────────────
     no method or default for coercing "character" to "factor"
     Backtrace:
     1. testthat::expect_equal(object, firstObject)
     16. methods::as(tmp_frame$Var1, class(frame$Var1))
    
     ── 52. Error: Full SimulatedIncidenceMatrix : subset respects mat ─────────────
     no method or default for coercing "character" to "factor"
     Backtrace:
     1. testthat::expect_equal(object, firstObject)
     16. methods::as(tmp_frame$Var1, class(frame$Var1))
    
     ── 53. Error: Full SimulatedIncidenceMatrix : subset respects simulations ─────
     no method or default for coercing "character" to "factor"
     Backtrace:
     1. testthat::expect_equal(object, firstObject)
     16. methods::as(tmp_frame$Var1, class(frame$Var1))
    
     ── 54. Error: Full SimulatedIncidenceMatrix : subset respects arr ─────────────
     no method or default for coercing "character" to "factor"
     Backtrace:
     1. testthat::expect_equal(object, firstObject)
     16. methods::as(tmp_frame$Var1, class(frame$Var1))
    
     ── 55. Error: Full SimulatedIncidenceMatrix : addColumns respects mat ─────────
     no method or default for coercing "character" to "factor"
     Backtrace:
     1. testthat::expect_equal(object, firstObject)
     16. methods::as(tmp_frame$Var1, class(frame$Var1))
    
     ── 56. Error: Full SimulatedIncidenceMatrix : addColumns respects simulations ─
     no method or default for coercing "character" to "factor"
     Backtrace:
     1. testthat::expect_equal(object, firstObject)
     16. methods::as(tmp_frame$Var1, class(frame$Var1))
    
     ── 57. Error: Full SimulatedIncidenceMatrix : addColumns respects arr ─────────
     no method or default for coercing "character" to "factor"
     Backtrace:
     1. testthat::expect_equal(object, firstObject)
     16. methods::as(tmp_frame$Var1, class(frame$Var1))
    
     ── 58. Error: Full SimulatedIncidenceMatrix : addRows respects mat ────────────
     no method or default for coercing "character" to "factor"
     Backtrace:
     1. testthat::expect_equal(object, firstObject)
     16. methods::as(tmp_frame$Var1, class(frame$Var1))
    
     ── 59. Error: Full SimulatedIncidenceMatrix : addRows respects simulations ────
     no method or default for coercing "character" to "factor"
     Backtrace:
     1. testthat::expect_equal(object, firstObject)
     16. methods::as(tmp_frame$Var1, class(frame$Var1))
    
     ── 60. Error: Full SimulatedIncidenceMatrix : addRows respects arr ────────────
     no method or default for coercing "character" to "factor"
     Backtrace:
     1. testthat::expect_equal(object, firstObject)
     16. methods::as(tmp_frame$Var1, class(frame$Var1))
    
     ── 61. Error: Full SimulatedIncidenceMatrix : diff works ──────────────────────
     no method or default for coercing "character" to "factor"
     Backtrace:
     1. testthat::expect_equal(object, first_object)
     16. methods::as(tmp_frame$Var1, class(frame$Var1))
    
     ── 62. Error: Full SimulatedIncidenceMatrix : diff respects cnames ────────────
     no method or default for coercing "character" to "factor"
     Backtrace:
     1. testthat::expect_equal(object, first_object)
     16. methods::as(tmp_frame$Var1, class(frame$Var1))
    
     ── 63. Error: Full SimulatedIncidenceMatrix : diff respects ncol ──────────────
     no method or default for coercing "character" to "factor"
     Backtrace:
     1. testthat::expect_equal(object, first_object)
     16. methods::as(tmp_frame$Var1, class(frame$Var1))
    
     ── 64. Error: Full SimulatedIncidenceMatrix : diff respects nsim ──────────────
     no method or default for coercing "character" to "factor"
     Backtrace:
     1. testthat::expect_equal(object, first_object)
     16. methods::as(tmp_frame$Var1, class(frame$Var1))
    
     ── 65. Error: Full SimulatedIncidenceMatrix : diff respects nrow ──────────────
     no method or default for coercing "character" to "factor"
     Backtrace:
     1. testthat::expect_equal(object, first_object)
     16. methods::as(tmp_frame$Var1, class(frame$Var1))
    
     ── 66. Error: Full SimulatedIncidenceMatrix : diff respects rnames ────────────
     no method or default for coercing "character" to "factor"
     Backtrace:
     1. testthat::expect_equal(object, first_object)
     16. methods::as(tmp_frame$Var1, class(frame$Var1))
    
     ── 67. Error: Full SimulatedIncidenceMatrix : diff respects colData ───────────
     no method or default for coercing "character" to "factor"
     Backtrace:
     1. testthat::expect_equal(object, first_object)
     16. methods::as(tmp_frame$Var1, class(frame$Var1))
    
     ── 68. Error: Full SimulatedIncidenceMatrix : diff respects mat ───────────────
     no method or default for coercing "character" to "factor"
     Backtrace:
     1. testthat::expect_equal(object, first_object)
     16. methods::as(tmp_frame$Var1, class(frame$Var1))
    
     ── 69. Error: Full SimulatedIncidenceMatrix : diff respects simulations ───────
     no method or default for coercing "character" to "factor"
     Backtrace:
     1. testthat::expect_equal(object, first_object)
     16. methods::as(tmp_frame$Var1, class(frame$Var1))
    
     ── 70. Error: Full SimulatedIncidenceMatrix : diff respects arr ───────────────
     no method or default for coercing "character" to "factor"
     Backtrace:
     1. testthat::expect_equal(object, first_object)
     16. methods::as(tmp_frame$Var1, class(frame$Var1))
    
     ── 71. Error: Full SimulatedIncidenceMatrix : diff respects metaData ──────────
     no method or default for coercing "character" to "factor"
     Backtrace:
     1. testthat::expect_equal(object, first_object)
     16. methods::as(tmp_frame$Var1, class(frame$Var1))
    
     ── 72. Error: Full SimulatedIncidenceMatrix : diff respects rowData ───────────
     no method or default for coercing "character" to "factor"
     Backtrace:
     1. testthat::expect_equal(object, first_object)
     16. methods::as(tmp_frame$Var1, class(frame$Var1))
    
     ── 73. Error: Full SimulatedIncidenceMatrix : head respects mat ───────────────
     no method or default for coercing "character" to "factor"
     Backtrace:
     1. testthat::expect_equal(object, firstObject)
     16. methods::as(tmp_frame$Var1, class(frame$Var1))
    
     ── 74. Error: Full SimulatedIncidenceMatrix : head respects simulations ───────
     no method or default for coercing "character" to "factor"
     Backtrace:
     1. testthat::expect_equal(object, firstObject)
     16. methods::as(tmp_frame$Var1, class(frame$Var1))
    
     ── 75. Error: Full SimulatedIncidenceMatrix : head respects arr ───────────────
     no method or default for coercing "character" to "factor"
     Backtrace:
     1. testthat::expect_equal(object, firstObject)
     16. methods::as(tmp_frame$Var1, class(frame$Var1))
    
     ── 76. Error: Full SimulatedIncidenceMatrix : scale works ─────────────────────
     no method or default for coercing "character" to "factor"
     Backtrace:
     1. testthat::expect_equal(first_object, object)
     16. methods::as(tmp_frame$Var1, class(frame$Var1))
    
     ── 77. Error: Full SimulatedIncidenceMatrix : scale respects nrow ─────────────
     no method or default for coercing "character" to "factor"
     Backtrace:
     1. testthat::expect_equal(first_object, object)
     16. methods::as(tmp_frame$Var1, class(frame$Var1))
    
     ── 78. Error: Full SimulatedIncidenceMatrix : scale respects ncol ─────────────
     no method or default for coercing "character" to "factor"
     Backtrace:
     1. testthat::expect_equal(first_object, object)
     16. methods::as(tmp_frame$Var1, class(frame$Var1))
    
     ── 79. Error: Full SimulatedIncidenceMatrix : scale respects nsim ─────────────
     no method or default for coercing "character" to "factor"
     Backtrace:
     1. testthat::expect_equal(first_object, object)
     16. methods::as(tmp_frame$Var1, class(frame$Var1))
    
     ── 80. Error: Full SimulatedIncidenceMatrix : scale respects cnames ───────────
     no method or default for coercing "character" to "factor"
     Backtrace:
     1. testthat::expect_equal(first_object, object)
     16. methods::as(tmp_frame$Var1, class(frame$Var1))
    
     ── 81. Error: Full SimulatedIncidenceMatrix : scale respects rnames ───────────
     no method or default for coercing "character" to "factor"
     Backtrace:
     1. testthat::expect_equal(first_object, object)
     16. methods::as(tmp_frame$Var1, class(frame$Var1))
    
     ── 82. Error: Full SimulatedIncidenceMatrix : scale respects colData ──────────
     no method or default for coercing "character" to "factor"
     Backtrace:
     1. testthat::expect_equal(first_object, object)
     16. methods::as(tmp_frame$Var1, class(frame$Var1))
    
     ── 83. Error: Full SimulatedIncidenceMatrix : scale respects rowData ──────────
     no method or default for coercing "character" to "factor"
     Backtrace:
     1. testthat::expect_equal(first_object, object)
     16. methods::as(tmp_frame$Var1, class(frame$Var1))
    
     ── 84. Error: Full SimulatedIncidenceMatrix : scale respects metaData ─────────
     no method or default for coercing "character" to "factor"
     Backtrace:
     1. testthat::expect_equal(first_object, object)
     16. methods::as(tmp_frame$Var1, class(frame$Var1))
    
     ── 85. Error: Full SimulatedIncidenceMatrix : scale respects mat ──────────────
     no method or default for coercing "character" to "factor"
     Backtrace:
     1. testthat::expect_equal(first_object, object)
     16. methods::as(tmp_frame$Var1, class(frame$Var1))
    
     ── 86. Error: Full SimulatedIncidenceMatrix : scale respects simulations ──────
     no method or default for coercing "character" to "factor"
     Backtrace:
     1. testthat::expect_equal(first_object, object)
     16. methods::as(tmp_frame$Var1, class(frame$Var1))
    
     ── 87. Error: Full SimulatedIncidenceMatrix : scale respects arr ──────────────
     no method or default for coercing "character" to "factor"
     Backtrace:
     1. testthat::expect_equal(first_object, object)
     16. methods::as(tmp_frame$Var1, class(frame$Var1))
    
     ── 88. Error: Full SimulatedIncidenceMatrix : addError works ──────────────────
     no method or default for coercing "character" to "factor"
     Backtrace:
     1. testthat::expect_equal(first_object, object)
     16. methods::as(tmp_frame$Var1, class(frame$Var1))
    
     ── 89. Error: Full SimulatedIncidenceMatrix : addError respects ncol ──────────
     no method or default for coercing "character" to "factor"
     Backtrace:
     1. testthat::expect_equal(first_object, object)
     16. methods::as(tmp_frame$Var1, class(frame$Var1))
    
     ── 90. Error: Full SimulatedIncidenceMatrix : addError respects nrow ──────────
     no method or default for coercing "character" to "factor"
     Backtrace:
     1. testthat::expect_equal(first_object, object)
     16. methods::as(tmp_frame$Var1, class(frame$Var1))
    
     ── 91. Error: Full SimulatedIncidenceMatrix : addError respects ncol ──────────
     no method or default for coercing "character" to "factor"
     Backtrace:
     1. testthat::expect_equal(first_object, object)
     16. methods::as(tmp_frame$Var1, class(frame$Var1))
    
     ── 92. Error: Full SimulatedIncidenceMatrix : addError respects cnames ────────
     no method or default for coercing "character" to "factor"
     Backtrace:
     1. testthat::expect_equal(first_object, object)
     16. methods::as(tmp_frame$Var1, class(frame$Var1))
    
     ── 93. Error: Full SimulatedIncidenceMatrix : addError respects rnames ────────
     no method or default for coercing "character" to "factor"
     Backtrace:
     1. testthat::expect_equal(first_object, object)
     16. methods::as(tmp_frame$Var1, class(frame$Var1))
    
     ── 94. Error: Full SimulatedIncidenceMatrix : addError respects colData ───────
     no method or default for coercing "character" to "factor"
     Backtrace:
     1. testthat::expect_equal(first_object, object)
     16. methods::as(tmp_frame$Var1, class(frame$Var1))
    
     ── 95. Error: Full SimulatedIncidenceMatrix : addError respects rowData ───────
     no method or default for coercing "character" to "factor"
     Backtrace:
     1. testthat::expect_equal(first_object, object)
     16. methods::as(tmp_frame$Var1, class(frame$Var1))
    
     ── 96. Error: Full SimulatedIncidenceMatrix : addError respects metaData ──────
     no method or default for coercing "character" to "factor"
     Backtrace:
     1. testthat::expect_equal(first_object, object)
     16. methods::as(tmp_frame$Var1, class(frame$Var1))
    
     ── 97. Error: Full SimulatedIncidenceMatrix : addError respects metaData ──────
     no method or default for coercing "character" to "factor"
     Backtrace:
     1. testthat::expect_equal(first_object, object)
     16. methods::as(tmp_frame$Var1, class(frame$Var1))
    
     ── 98. Error: Full SimulatedIncidenceMatrix : addError respects nsim ──────────
     no method or default for coercing "character" to "factor"
     Backtrace:
     1. testthat::expect_equal(first_object, object)
     16. methods::as(tmp_frame$Var1, class(frame$Var1))
    
     ── 99. Error: Full SimulatedIncidenceMatrix : addError respects nsim ──────────
     no method or default for coercing "character" to "factor"
     Backtrace:
     1. testthat::expect_equal(first_object, object)
     16. methods::as(tmp_frame$Var1, class(frame$Var1))
    
     ── 100. Error: Full SimulatedIncidenceMatrix : addError respects mat ──────────
     no method or default for coercing "character" to "factor"
     Backtrace:
     1. testthat::expect_equal(first_object, object)
     16. methods::as(tmp_frame$Var1, class(frame$Var1))
    
     ── 101. Error: Full SimulatedIncidenceMatrix : addError respects simulations ──
     no method or default for coercing "character" to "factor"
     Backtrace:
     1. testthat::expect_equal(first_object, object)
     16. methods::as(tmp_frame$Var1, class(frame$Var1))
    
     ── 102. Error: Full SimulatedIncidenceMatrix : addError respects arr ──────────
     no method or default for coercing "character" to "factor"
     Backtrace:
     1. testthat::expect_equal(first_object, object)
     16. methods::as(tmp_frame$Var1, class(frame$Var1))
    
     ── 103. Error: Full SimulatedIncidenceMatrix : summarize works ────────────────
     no method or default for coercing "character" to "factor"
     Backtrace:
     1. testthat::expect_equal(first_object, object)
     16. methods::as(tmp_frame$Var1, class(frame$Var1))
    
     ── 104. Error: List SimulatedIncidenceMatrix : Active bindings have correct mode
     no method or default for coercing "character" to "factor"
     Backtrace:
     1. testthat::expect_equal(first_object, object)
     16. methods::as(tmp_frame$Var1, class(frame$Var1))
    
     ── 105. Error: List SimulatedIncidenceMatrix : tail respects mat ──────────────
     no method or default for coercing "character" to "factor"
     Backtrace:
     1. testthat::expect_equal(object, firstObject)
     16. methods::as(tmp_frame$Var1, class(frame$Var1))
    
     ── 106. Error: List SimulatedIncidenceMatrix : tail respects simulations ──────
     no method or default for coercing "character" to "factor"
     Backtrace:
     1. testthat::expect_equal(object, firstObject)
     16. methods::as(tmp_frame$Var1, class(frame$Var1))
    
     ── 107. Error: List SimulatedIncidenceMatrix : tail respects arr ──────────────
     no method or default for coercing "character" to "factor"
     Backtrace:
     1. testthat::expect_equal(object, firstObject)
     16. methods::as(tmp_frame$Var1, class(frame$Var1))
    
     ── 108. Error: List SimulatedIncidenceMatrix : mutate works ───────────────────
     no method or default for coercing "character" to "factor"
     Backtrace:
     1. testthat::expect_equal(object, firstObject)
     16. methods::as(tmp_frame$Var1, class(frame$Var1))
    
     ── 109. Error: List SimulatedIncidenceMatrix : subset respects mat ────────────
     no method or default for coercing "character" to "factor"
     Backtrace:
     1. testthat::expect_equal(object, firstObject)
     16. methods::as(tmp_frame$Var1, class(frame$Var1))
    
     ── 110. Error: List SimulatedIncidenceMatrix : subset respects simulations ────
     no method or default for coercing "character" to "factor"
     Backtrace:
     1. testthat::expect_equal(object, firstObject)
     16. methods::as(tmp_frame$Var1, class(frame$Var1))
    
     ── 111. Error: List SimulatedIncidenceMatrix : subset respects arr ────────────
     no method or default for coercing "character" to "factor"
     Backtrace:
     1. testthat::expect_equal(object, firstObject)
     16. methods::as(tmp_frame$Var1, class(frame$Var1))
    
     ── 112. Error: List SimulatedIncidenceMatrix : mutate works ───────────────────
     no method or default for coercing "character" to "factor"
     Backtrace:
     1. testthat::expect_equal(object, firstObject)
     16. methods::as(tmp_frame$Var1, class(frame$Var1))
    
     ── 113. Error: List SimulatedIncidenceMatrix : subset respects mat ────────────
     no method or default for coercing "character" to "factor"
     Backtrace:
     1. testthat::expect_equal(object, firstObject)
     16. methods::as(tmp_frame$Var1, class(frame$Var1))
    
     ── 114. Error: List SimulatedIncidenceMatrix : subset respects simulations ────
     no method or default for coercing "character" to "factor"
     Backtrace:
     1. testthat::expect_equal(object, firstObject)
     16. methods::as(tmp_frame$Var1, class(frame$Var1))
    
     ── 115. Error: List SimulatedIncidenceMatrix : subset respects arr ────────────
     no method or default for coercing "character" to "factor"
     Backtrace:
     1. testthat::expect_equal(object, firstObject)
     16. methods::as(tmp_frame$Var1, class(frame$Var1))
    
     ── 116. Error: List SimulatedIncidenceMatrix : addColumns respects mat ────────
     no method or default for coercing "character" to "factor"
     Backtrace:
     1. testthat::expect_equal(object, firstObject)
     16. methods::as(tmp_frame$Var1, class(frame$Var1))
    
     ── 117. Error: List SimulatedIncidenceMatrix : addColumns respects simulations
     no method or default for coercing "character" to "factor"
     Backtrace:
     1. testthat::expect_equal(object, firstObject)
     16. methods::as(tmp_frame$Var1, class(frame$Var1))
    
     ── 118. Error: List SimulatedIncidenceMatrix : addColumns respects arr ────────
     no method or default for coercing "character" to "factor"
     Backtrace:
     1. testthat::expect_equal(object, firstObject)
     16. methods::as(tmp_frame$Var1, class(frame$Var1))
    
     ── 119. Error: List SimulatedIncidenceMatrix : addRows respects mat ───────────
     no method or default for coercing "character" to "factor"
     Backtrace:
     1. testthat::expect_equal(object, firstObject)
     16. methods::as(tmp_frame$Var1, class(frame$Var1))
    
     ── 120. Error: List SimulatedIncidenceMatrix : addRows respects simulations ───
     no method or default for coercing "character" to "factor"
     Backtrace:
     1. testthat::expect_equal(object, firstObject)
     16. methods::as(tmp_frame$Var1, class(frame$Var1))
    
     ── 121. Error: List SimulatedIncidenceMatrix : addRows respects arr ───────────
     no method or default for coercing "character" to "factor"
     Backtrace:
     1. testthat::expect_equal(object, firstObject)
     16. methods::as(tmp_frame$Var1, class(frame$Var1))
    
     ── 122. Error: List SimulatedIncidenceMatrix : diff works ─────────────────────
     no method or default for coercing "character" to "factor"
     Backtrace:
     1. testthat::expect_equal(object, first_object)
     16. methods::as(tmp_frame$Var1, class(frame$Var1))
    
     ── 123. Error: List SimulatedIncidenceMatrix : diff respects cnames ───────────
     no method or default for coercing "character" to "factor"
     Backtrace:
     1. testthat::expect_equal(object, first_object)
     16. methods::as(tmp_frame$Var1, class(frame$Var1))
    
     ── 124. Error: List SimulatedIncidenceMatrix : diff respects ncol ─────────────
     no method or default for coercing "character" to "factor"
     Backtrace:
     1. testthat::expect_equal(object, first_object)
     16. methods::as(tmp_frame$Var1, class(frame$Var1))
    
     ── 125. Error: List SimulatedIncidenceMatrix : diff respects nsim ─────────────
     no method or default for coercing "character" to "factor"
     Backtrace:
     1. testthat::expect_equal(object, first_object)
     16. methods::as(tmp_frame$Var1, class(frame$Var1))
    
     ── 126. Error: List SimulatedIncidenceMatrix : diff respects nrow ─────────────
     no method or default for coercing "character" to "factor"
     Backtrace:
     1. testthat::expect_equal(object, first_object)
     16. methods::as(tmp_frame$Var1, class(frame$Var1))
    
     ── 127. Error: List SimulatedIncidenceMatrix : diff respects rnames ───────────
     no method or default for coercing "character" to "factor"
     Backtrace:
     1. testthat::expect_equal(object, first_object)
     16. methods::as(tmp_frame$Var1, class(frame$Var1))
    
     ── 128. Error: List SimulatedIncidenceMatrix : diff respects colData ──────────
     no method or default for coercing "character" to "factor"
     Backtrace:
     1. testthat::expect_equal(object, first_object)
     16. methods::as(tmp_frame$Var1, class(frame$Var1))
    
     ── 129. Error: List SimulatedIncidenceMatrix : diff respects mat ──────────────
     no method or default for coercing "character" to "factor"
     Backtrace:
     1. testthat::expect_equal(object, first_object)
     16. methods::as(tmp_frame$Var1, class(frame$Var1))
    
     ── 130. Error: List SimulatedIncidenceMatrix : diff respects simulations ──────
     no method or default for coercing "character" to "factor"
     Backtrace:
     1. testthat::expect_equal(object, first_object)
     16. methods::as(tmp_frame$Var1, class(frame$Var1))
    
     ── 131. Error: List SimulatedIncidenceMatrix : diff respects arr ──────────────
     no method or default for coercing "character" to "factor"
     Backtrace:
     1. testthat::expect_equal(object, first_object)
     16. methods::as(tmp_frame$Var1, class(frame$Var1))
    
     ── 132. Error: List SimulatedIncidenceMatrix : diff respects metaData ─────────
     no method or default for coercing "character" to "factor"
     Backtrace:
     1. testthat::expect_equal(object, first_object)
     16. methods::as(tmp_frame$Var1, class(frame$Var1))
    
     ── 133. Error: List SimulatedIncidenceMatrix : diff respects rowData ──────────
     no method or default for coercing "character" to "factor"
     Backtrace:
     1. testthat::expect_equal(object, first_object)
     16. methods::as(tmp_frame$Var1, class(frame$Var1))
    
     ── 134. Error: List SimulatedIncidenceMatrix : head respects mat ──────────────
     no method or default for coercing "character" to "factor"
     Backtrace:
     1. testthat::expect_equal(object, firstObject)
     16. methods::as(tmp_frame$Var1, class(frame$Var1))
    
     ── 135. Error: List SimulatedIncidenceMatrix : head respects simulations ──────
     no method or default for coercing "character" to "factor"
     Backtrace:
     1. testthat::expect_equal(object, firstObject)
     16. methods::as(tmp_frame$Var1, class(frame$Var1))
    
     ── 136. Error: List SimulatedIncidenceMatrix : head respects arr ──────────────
     no method or default for coercing "character" to "factor"
     Backtrace:
     1. testthat::expect_equal(object, firstObject)
     16. methods::as(tmp_frame$Var1, class(frame$Var1))
    
     ── 137. Error: List SimulatedIncidenceMatrix : scale works ────────────────────
     no method or default for coercing "character" to "factor"
     Backtrace:
     1. testthat::expect_equal(first_object, object)
     16. methods::as(tmp_frame$Var1, class(frame$Var1))
    
     ── 138. Error: List SimulatedIncidenceMatrix : scale respects nrow ────────────
     no method or default for coercing "character" to "factor"
     Backtrace:
     1. testthat::expect_equal(first_object, object)
     16. methods::as(tmp_frame$Var1, class(frame$Var1))
    
     ── 139. Error: List SimulatedIncidenceMatrix : scale respects ncol ────────────
     no method or default for coercing "character" to "factor"
     Backtrace:
     1. testthat::expect_equal(first_object, object)
     16. methods::as(tmp_frame$Var1, class(frame$Var1))
    
     ── 140. Error: List SimulatedIncidenceMatrix : scale respects nsim ────────────
     no method or default for coercing "character" to "factor"
     Backtrace:
     1. testthat::expect_equal(first_object, object)
     16. methods::as(tmp_frame$Var1, class(frame$Var1))
    
     ── 141. Error: List SimulatedIncidenceMatrix : scale respects cnames ──────────
     no method or default for coercing "character" to "factor"
     Backtrace:
     1. testthat::expect_equal(first_object, object)
     16. methods::as(tmp_frame$Var1, class(frame$Var1))
    
     ── 142. Error: List SimulatedIncidenceMatrix : scale respects rnames ──────────
     no method or default for coercing "character" to "factor"
     Backtrace:
     1. testthat::expect_equal(first_object, object)
     16. methods::as(tmp_frame$Var1, class(frame$Var1))
    
     ── 143. Error: List SimulatedIncidenceMatrix : scale respects colData ─────────
     no method or default for coercing "character" to "factor"
     Backtrace:
     1. testthat::expect_equal(first_object, object)
     16. methods::as(tmp_frame$Var1, class(frame$Var1))
    
     ── 144. Error: List SimulatedIncidenceMatrix : scale respects rowData ─────────
     no method or default for coercing "character" to "factor"
     Backtrace:
     1. testthat::expect_equal(first_object, object)
     16. methods::as(tmp_frame$Var1, class(frame$Var1))
    
     ── 145. Error: List SimulatedIncidenceMatrix : scale respects metaData ────────
     no method or default for coercing "character" to "factor"
     Backtrace:
     1. testthat::expect_equal(first_object, object)
     16. methods::as(tmp_frame$Var1, class(frame$Var1))
    
     ── 146. Error: List SimulatedIncidenceMatrix : scale respects mat ─────────────
     no method or default for coercing "character" to "factor"
     Backtrace:
     1. testthat::expect_equal(first_object, object)
     16. methods::as(tmp_frame$Var1, class(frame$Var1))
    
     ── 147. Error: List SimulatedIncidenceMatrix : scale respects simulations ─────
     no method or default for coercing "character" to "factor"
     Backtrace:
     1. testthat::expect_equal(first_object, object)
     16. methods::as(tmp_frame$Var1, class(frame$Var1))
    
     ── 148. Error: List SimulatedIncidenceMatrix : scale respects arr ─────────────
     no method or default for coercing "character" to "factor"
     Backtrace:
     1. testthat::expect_equal(first_object, object)
     16. methods::as(tmp_frame$Var1, class(frame$Var1))
    
     ── 149. Error: List SimulatedIncidenceMatrix : addError works ─────────────────
     no method or default for coercing "character" to "factor"
     Backtrace:
     1. testthat::expect_equal(first_object, object)
     16. methods::as(tmp_frame$Var1, class(frame$Var1))
    
     ── 150. Error: List SimulatedIncidenceMatrix : addError respects ncol ─────────
     no method or default for coercing "character" to "factor"
     Backtrace:
     1. testthat::expect_equal(first_object, object)
     16. methods::as(tmp_frame$Var1, class(frame$Var1))
    
     ── 151. Error: List SimulatedIncidenceMatrix : addError respects nrow ─────────
     no method or default for coercing "character" to "factor"
     Backtrace:
     1. testthat::expect_equal(first_object, object)
     16. methods::as(tmp_frame$Var1, class(frame$Var1))
    
     ── 152. Error: List SimulatedIncidenceMatrix : addError respects ncol ─────────
     no method or default for coercing "character" to "factor"
     Backtrace:
     1. testthat::expect_equal(first_object, object)
     16. methods::as(tmp_frame$Var1, class(frame$Var1))
    
     ── 153. Error: List SimulatedIncidenceMatrix : addError respects cnames ───────
     no method or default for coercing "character" to "factor"
     Backtrace:
     1. testthat::expect_equal(first_object, object)
     16. methods::as(tmp_frame$Var1, class(frame$Var1))
    
     ── 154. Error: List SimulatedIncidenceMatrix : addError respects rnames ───────
     no method or default for coercing "character" to "factor"
     Backtrace:
     1. testthat::expect_equal(first_object, object)
     16. methods::as(tmp_frame$Var1, class(frame$Var1))
    
     ── 155. Error: List SimulatedIncidenceMatrix : addError respects colData ──────
     no method or default for coercing "character" to "factor"
     Backtrace:
     1. testthat::expect_equal(first_object, object)
     16. methods::as(tmp_frame$Var1, class(frame$Var1))
    
     ── 156. Error: List SimulatedIncidenceMatrix : addError respects rowData ──────
     no method or default for coercing "character" to "factor"
     Backtrace:
     1. testthat::expect_equal(first_object, object)
     16. methods::as(tmp_frame$Var1, class(frame$Var1))
    
     ── 157. Error: List SimulatedIncidenceMatrix : addError respects metaData ─────
     no method or default for coercing "character" to "factor"
     Backtrace:
     1. testthat::expect_equal(first_object, object)
     16. methods::as(tmp_frame$Var1, class(frame$Var1))
    
     ── 158. Error: List SimulatedIncidenceMatrix : addError respects metaData ─────
     no method or default for coercing "character" to "factor"
     Backtrace:
     1. testthat::expect_equal(first_object, object)
     16. methods::as(tmp_frame$Var1, class(frame$Var1))
    
     ── 159. Error: List SimulatedIncidenceMatrix : addError respects nsim ─────────
     no method or default for coercing "character" to "factor"
     Backtrace:
     1. testthat::expect_equal(first_object, object)
     16. methods::as(tmp_frame$Var1, class(frame$Var1))
    
     ── 160. Error: List SimulatedIncidenceMatrix : addError respects nsim ─────────
     no method or default for coercing "character" to "factor"
     Backtrace:
     1. testthat::expect_equal(first_object, object)
     16. methods::as(tmp_frame$Var1, class(frame$Var1))
    
     ── 161. Error: List SimulatedIncidenceMatrix : addError respects mat ──────────
     no method or default for coercing "character" to "factor"
     Backtrace:
     1. testthat::expect_equal(first_object, object)
     16. methods::as(tmp_frame$Var1, class(frame$Var1))
    
     ── 162. Error: List SimulatedIncidenceMatrix : addError respects simulations ──
     no method or default for coercing "character" to "factor"
     Backtrace:
     1. testthat::expect_equal(first_object, object)
     16. methods::as(tmp_frame$Var1, class(frame$Var1))
    
     ── 163. Error: List SimulatedIncidenceMatrix : addError respects arr ──────────
     no method or default for coercing "character" to "factor"
     Backtrace:
     1. testthat::expect_equal(first_object, object)
     16. methods::as(tmp_frame$Var1, class(frame$Var1))
    
     ── 164. Error: List SimulatedIncidenceMatrix : summarize works ────────────────
     no method or default for coercing "character" to "factor"
     Backtrace:
     1. testthat::expect_equal(first_object, object)
     16. methods::as(tmp_frame$Var1, class(frame$Var1))
    
     ── 165. Error: Full IncidenceForecast : mean works ────────────────────────────
     no method or default for coercing "character" to "factor"
     Backtrace:
     1. testthat::expect_that(...)
     20. methods::as(tmp_frame$Var1, class(frame$Var1))
    
     ── 166. Error: Full IncidenceForecast : median works ──────────────────────────
     no method or default for coercing "character" to "factor"
     Backtrace:
     1. testthat::expect_that(...)
     20. methods::as(tmp_frame$Var1, class(frame$Var1))
    
     ── 167. Error: Full IncidenceForecast : Inherited Methods don't change object ─
     no method or default for coercing "character" to "factor"
     Backtrace:
     1. equivalence(first_object)(object)
     19. methods::as(tmp_frame$Var1, class(frame$Var1))
    
     ── 168. Error: Full IncidenceForecast : sample works ──────────────────────────
     no method or default for coercing "character" to "factor"
     Backtrace:
     1. testthat::expect_that(first_object, equals(object))
     28. methods::as(tmp_frame$Var1, class(frame$Var1))
    
     ══ testthat results ═══════════════════════════════════════════════════════════
     [ OK: 10173 | SKIPPED: 207 | WARNINGS: 123 | FAILED: 168 ]
     1. Error: Full IncidenceMatrix : Active bindings have correct mode.
     2. Error: Full IncidenceMatrix : tail respects mat
     3. Error: Full IncidenceMatrix : mutate works
     4. Error: Full IncidenceMatrix : mutate respects nrow
     5. Error: Full IncidenceMatrix : mutate respects ncol
     6. Error: Full IncidenceMatrix : mutate respects rnames
     7. Error: Full IncidenceMatrix : mutate respects cnames
     8. Error: Full IncidenceMatrix : mutate respects metaData
     9. Error: Full IncidenceMatrix : mutate respects rowData
     1. ...
    
     Error: testthat unit tests failed
     Execution halted
Flavor: r-devel-linux-x86_64-fedora-clang

Version: 0.10.3
Check: tests
Result: ERROR
     Running ‘testthat.R’ [274s/320s]
    Running the tests in ‘tests/testthat.R’ failed.
    Complete output:
     > library(testthat)
     > test_check("ForecastFramework")
     Loading required package: ForecastFramework
     Loading required package: R6
     ── 1. Error: Full IncidenceMatrix : Active bindings have correct mode. ────────
     argument is of length zero
     Backtrace:
    
     ── 2. Error: Full IncidenceMatrix : tail respects mat ─────────────────────────
     argument is of length zero
     Backtrace:
    
     ── 3. Error: Full IncidenceMatrix : mutate works ──────────────────────────────
     argument is of length zero
     Backtrace:
    
     ── 4. Error: Full IncidenceMatrix : mutate respects nrow ──────────────────────
     argument is of length zero
     Backtrace:
    
     ── 5. Error: Full IncidenceMatrix : mutate respects ncol ──────────────────────
     argument is of length zero
     Backtrace:
    
     ── 6. Error: Full IncidenceMatrix : mutate respects rnames ────────────────────
     argument is of length zero
     Backtrace:
    
     ── 7. Error: Full IncidenceMatrix : mutate respects cnames ────────────────────
     argument is of length zero
     Backtrace:
    
     ── 8. Error: Full IncidenceMatrix : mutate respects metaData ──────────────────
     argument is of length zero
     Backtrace:
    
     ── 9. Error: Full IncidenceMatrix : mutate respects rowData ───────────────────
     argument is of length zero
     Backtrace:
    
     ── 10. Error: Full IncidenceMatrix : mutate respects colData ──────────────────
     argument is of length zero
     Backtrace:
    
     ── 11. Error: Full IncidenceMatrix : subset respects mat ──────────────────────
     argument is of length zero
     Backtrace:
    
     ── 12. Error: Full IncidenceMatrix : mutate works ─────────────────────────────
     argument is of length zero
     Backtrace:
    
     ── 13. Error: Full IncidenceMatrix : mutate respects nrow ─────────────────────
     argument is of length zero
     Backtrace:
    
     ── 14. Error: Full IncidenceMatrix : mutate respects ncol ─────────────────────
     argument is of length zero
     Backtrace:
    
     ── 15. Error: Full IncidenceMatrix : mutate respects rnames ───────────────────
     argument is of length zero
     Backtrace:
    
     ── 16. Error: Full IncidenceMatrix : mutate respects cnames ───────────────────
     argument is of length zero
     Backtrace:
    
     ── 17. Error: Full IncidenceMatrix : mutate respects metaData ─────────────────
     argument is of length zero
     Backtrace:
    
     ── 18. Error: Full IncidenceMatrix : mutate respects rowData ──────────────────
     argument is of length zero
     Backtrace:
    
     ── 19. Error: Full IncidenceMatrix : mutate respects colData ──────────────────
     argument is of length zero
     Backtrace:
    
     ── 20. Error: Full IncidenceMatrix : subset respects mat ──────────────────────
     argument is of length zero
     Backtrace:
    
     ── 21. Error: Full IncidenceMatrix : addColumns respects mat ──────────────────
     argument is of length zero
     Backtrace:
    
     ── 22. Error: Full IncidenceMatrix : addRows respects mat ─────────────────────
     argument is of length zero
     Backtrace:
    
     ── 23. Error: Full IncidenceMatrix : mutate respects mat ──────────────────────
     argument is of length zero
     Backtrace:
    
     ── 24. Error: Full IncidenceMatrix : diff works ───────────────────────────────
     argument is of length zero
     Backtrace:
    
     ── 25. Error: Full IncidenceMatrix : diff respects ncol ───────────────────────
     argument is of length zero
     Backtrace:
    
     ── 26. Error: Full IncidenceMatrix : diff respects nrow ───────────────────────
     argument is of length zero
     Backtrace:
    
     ── 27. Error: Full IncidenceMatrix : diff respects rnames ─────────────────────
     argument is of length zero
     Backtrace:
    
     ── 28. Error: Full IncidenceMatrix : diff respects cnames ─────────────────────
     argument is of length zero
     Backtrace:
    
     ── 29. Error: Full IncidenceMatrix : diff respects colData ────────────────────
     argument is of length zero
     Backtrace:
    
     ── 30. Error: Full IncidenceMatrix : diff respects mat ────────────────────────
     argument is of length zero
     Backtrace:
    
     ── 31. Error: Full IncidenceMatrix : diff respects metaData ───────────────────
     argument is of length zero
     Backtrace:
    
     ── 32. Error: Full IncidenceMatrix : diff respects rowData ────────────────────
     argument is of length zero
     Backtrace:
    
     ── 33. Error: Full IncidenceMatrix : head respects mat ────────────────────────
     argument is of length zero
     Backtrace:
    
     ── 34. Error: Full IncidenceMatrix : scale works ──────────────────────────────
     argument is of length zero
     Backtrace:
    
     ── 35. Error: Full IncidenceMatrix : scale respects nrow ──────────────────────
     argument is of length zero
     Backtrace:
    
     ── 36. Error: Full IncidenceMatrix : scale respects ncol ──────────────────────
     argument is of length zero
     Backtrace:
    
     ── 37. Error: Full IncidenceMatrix : scale respects cnames ────────────────────
     argument is of length zero
     Backtrace:
    
     ── 38. Error: Full IncidenceMatrix : scale respects rnames ────────────────────
     argument is of length zero
     Backtrace:
    
     ── 39. Error: Full IncidenceMatrix : scale respects colData ───────────────────
     argument is of length zero
     Backtrace:
    
     ── 40. Error: Full IncidenceMatrix : scale respects rowData ───────────────────
     argument is of length zero
     Backtrace:
    
     ── 41. Error: Full IncidenceMatrix : scale respects metaData ──────────────────
     argument is of length zero
     Backtrace:
    
     ── 42. Error: Full IncidenceMatrix : scale respects mat ───────────────────────
     argument is of length zero
     Backtrace:
    
     ── 43. Error: Full SimulatedIncidenceMatrix : Active bindings have correct mode.
     no method or default for coercing "character" to "factor"
     Backtrace:
     1. testthat::expect_equal(first_object, object)
     16. methods::as(tmp_frame$Var1, class(frame$Var1))
    
     ── 44. Error: Full SimulatedIncidenceMatrix : tail respects mat ───────────────
     no method or default for coercing "character" to "factor"
     Backtrace:
     1. testthat::expect_equal(object, firstObject)
     16. methods::as(tmp_frame$Var1, class(frame$Var1))
    
     ── 45. Error: Full SimulatedIncidenceMatrix : tail respects simulations ───────
     no method or default for coercing "character" to "factor"
     Backtrace:
     1. testthat::expect_equal(object, firstObject)
     16. methods::as(tmp_frame$Var1, class(frame$Var1))
    
     ── 46. Error: Full SimulatedIncidenceMatrix : tail respects arr ───────────────
     no method or default for coercing "character" to "factor"
     Backtrace:
     1. testthat::expect_equal(object, firstObject)
     16. methods::as(tmp_frame$Var1, class(frame$Var1))
    
     ── 47. Error: Full SimulatedIncidenceMatrix : mutate works ────────────────────
     no method or default for coercing "character" to "factor"
     Backtrace:
     1. testthat::expect_equal(object, firstObject)
     16. methods::as(tmp_frame$Var1, class(frame$Var1))
    
     ── 48. Error: Full SimulatedIncidenceMatrix : subset respects mat ─────────────
     no method or default for coercing "character" to "factor"
     Backtrace:
     1. testthat::expect_equal(object, firstObject)
     16. methods::as(tmp_frame$Var1, class(frame$Var1))
    
     ── 49. Error: Full SimulatedIncidenceMatrix : subset respects simulations ─────
     no method or default for coercing "character" to "factor"
     Backtrace:
     1. testthat::expect_equal(object, firstObject)
     16. methods::as(tmp_frame$Var1, class(frame$Var1))
    
     ── 50. Error: Full SimulatedIncidenceMatrix : subset respects arr ─────────────
     no method or default for coercing "character" to "factor"
     Backtrace:
     1. testthat::expect_equal(object, firstObject)
     16. methods::as(tmp_frame$Var1, class(frame$Var1))
    
     ── 51. Error: Full SimulatedIncidenceMatrix : mutate works ────────────────────
     no method or default for coercing "character" to "factor"
     Backtrace:
     1. testthat::expect_equal(object, firstObject)
     16. methods::as(tmp_frame$Var1, class(frame$Var1))
    
     ── 52. Error: Full SimulatedIncidenceMatrix : subset respects mat ─────────────
     no method or default for coercing "character" to "factor"
     Backtrace:
     1. testthat::expect_equal(object, firstObject)
     16. methods::as(tmp_frame$Var1, class(frame$Var1))
    
     ── 53. Error: Full SimulatedIncidenceMatrix : subset respects simulations ─────
     no method or default for coercing "character" to "factor"
     Backtrace:
     1. testthat::expect_equal(object, firstObject)
     16. methods::as(tmp_frame$Var1, class(frame$Var1))
    
     ── 54. Error: Full SimulatedIncidenceMatrix : subset respects arr ─────────────
     no method or default for coercing "character" to "factor"
     Backtrace:
     1. testthat::expect_equal(object, firstObject)
     16. methods::as(tmp_frame$Var1, class(frame$Var1))
    
     ── 55. Error: Full SimulatedIncidenceMatrix : addColumns respects mat ─────────
     no method or default for coercing "character" to "factor"
     Backtrace:
     1. testthat::expect_equal(object, firstObject)
     16. methods::as(tmp_frame$Var1, class(frame$Var1))
    
     ── 56. Error: Full SimulatedIncidenceMatrix : addColumns respects simulations ─
     no method or default for coercing "character" to "factor"
     Backtrace:
     1. testthat::expect_equal(object, firstObject)
     16. methods::as(tmp_frame$Var1, class(frame$Var1))
    
     ── 57. Error: Full SimulatedIncidenceMatrix : addColumns respects arr ─────────
     no method or default for coercing "character" to "factor"
     Backtrace:
     1. testthat::expect_equal(object, firstObject)
     16. methods::as(tmp_frame$Var1, class(frame$Var1))
    
     ── 58. Error: Full SimulatedIncidenceMatrix : addRows respects mat ────────────
     no method or default for coercing "character" to "factor"
     Backtrace:
     1. testthat::expect_equal(object, firstObject)
     16. methods::as(tmp_frame$Var1, class(frame$Var1))
    
     ── 59. Error: Full SimulatedIncidenceMatrix : addRows respects simulations ────
     no method or default for coercing "character" to "factor"
     Backtrace:
     1. testthat::expect_equal(object, firstObject)
     16. methods::as(tmp_frame$Var1, class(frame$Var1))
    
     ── 60. Error: Full SimulatedIncidenceMatrix : addRows respects arr ────────────
     no method or default for coercing "character" to "factor"
     Backtrace:
     1. testthat::expect_equal(object, firstObject)
     16. methods::as(tmp_frame$Var1, class(frame$Var1))
    
     ── 61. Error: Full SimulatedIncidenceMatrix : diff works ──────────────────────
     no method or default for coercing "character" to "factor"
     Backtrace:
     1. testthat::expect_equal(object, first_object)
     16. methods::as(tmp_frame$Var1, class(frame$Var1))
    
     ── 62. Error: Full SimulatedIncidenceMatrix : diff respects cnames ────────────
     no method or default for coercing "character" to "factor"
     Backtrace:
     1. testthat::expect_equal(object, first_object)
     16. methods::as(tmp_frame$Var1, class(frame$Var1))
    
     ── 63. Error: Full SimulatedIncidenceMatrix : diff respects ncol ──────────────
     no method or default for coercing "character" to "factor"
     Backtrace:
     1. testthat::expect_equal(object, first_object)
     16. methods::as(tmp_frame$Var1, class(frame$Var1))
    
     ── 64. Error: Full SimulatedIncidenceMatrix : diff respects nsim ──────────────
     no method or default for coercing "character" to "factor"
     Backtrace:
     1. testthat::expect_equal(object, first_object)
     16. methods::as(tmp_frame$Var1, class(frame$Var1))
    
     ── 65. Error: Full SimulatedIncidenceMatrix : diff respects nrow ──────────────
     no method or default for coercing "character" to "factor"
     Backtrace:
     1. testthat::expect_equal(object, first_object)
     16. methods::as(tmp_frame$Var1, class(frame$Var1))
    
     ── 66. Error: Full SimulatedIncidenceMatrix : diff respects rnames ────────────
     no method or default for coercing "character" to "factor"
     Backtrace:
     1. testthat::expect_equal(object, first_object)
     16. methods::as(tmp_frame$Var1, class(frame$Var1))
    
     ── 67. Error: Full SimulatedIncidenceMatrix : diff respects colData ───────────
     no method or default for coercing "character" to "factor"
     Backtrace:
     1. testthat::expect_equal(object, first_object)
     16. methods::as(tmp_frame$Var1, class(frame$Var1))
    
     ── 68. Error: Full SimulatedIncidenceMatrix : diff respects mat ───────────────
     no method or default for coercing "character" to "factor"
     Backtrace:
     1. testthat::expect_equal(object, first_object)
     16. methods::as(tmp_frame$Var1, class(frame$Var1))
    
     ── 69. Error: Full SimulatedIncidenceMatrix : diff respects simulations ───────
     no method or default for coercing "character" to "factor"
     Backtrace:
     1. testthat::expect_equal(object, first_object)
     16. methods::as(tmp_frame$Var1, class(frame$Var1))
    
     ── 70. Error: Full SimulatedIncidenceMatrix : diff respects arr ───────────────
     no method or default for coercing "character" to "factor"
     Backtrace:
     1. testthat::expect_equal(object, first_object)
     16. methods::as(tmp_frame$Var1, class(frame$Var1))
    
     ── 71. Error: Full SimulatedIncidenceMatrix : diff respects metaData ──────────
     no method or default for coercing "character" to "factor"
     Backtrace:
     1. testthat::expect_equal(object, first_object)
     16. methods::as(tmp_frame$Var1, class(frame$Var1))
    
     ── 72. Error: Full SimulatedIncidenceMatrix : diff respects rowData ───────────
     no method or default for coercing "character" to "factor"
     Backtrace:
     1. testthat::expect_equal(object, first_object)
     16. methods::as(tmp_frame$Var1, class(frame$Var1))
    
     ── 73. Error: Full SimulatedIncidenceMatrix : head respects mat ───────────────
     no method or default for coercing "character" to "factor"
     Backtrace:
     1. testthat::expect_equal(object, firstObject)
     16. methods::as(tmp_frame$Var1, class(frame$Var1))
    
     ── 74. Error: Full SimulatedIncidenceMatrix : head respects simulations ───────
     no method or default for coercing "character" to "factor"
     Backtrace:
     1. testthat::expect_equal(object, firstObject)
     16. methods::as(tmp_frame$Var1, class(frame$Var1))
    
     ── 75. Error: Full SimulatedIncidenceMatrix : head respects arr ───────────────
     no method or default for coercing "character" to "factor"
     Backtrace:
     1. testthat::expect_equal(object, firstObject)
     16. methods::as(tmp_frame$Var1, class(frame$Var1))
    
     ── 76. Error: Full SimulatedIncidenceMatrix : scale works ─────────────────────
     no method or default for coercing "character" to "factor"
     Backtrace:
     1. testthat::expect_equal(first_object, object)
     16. methods::as(tmp_frame$Var1, class(frame$Var1))
    
     ── 77. Error: Full SimulatedIncidenceMatrix : scale respects nrow ─────────────
     no method or default for coercing "character" to "factor"
     Backtrace:
     1. testthat::expect_equal(first_object, object)
     16. methods::as(tmp_frame$Var1, class(frame$Var1))
    
     ── 78. Error: Full SimulatedIncidenceMatrix : scale respects ncol ─────────────
     no method or default for coercing "character" to "factor"
     Backtrace:
     1. testthat::expect_equal(first_object, object)
     16. methods::as(tmp_frame$Var1, class(frame$Var1))
    
     ── 79. Error: Full SimulatedIncidenceMatrix : scale respects nsim ─────────────
     no method or default for coercing "character" to "factor"
     Backtrace:
     1. testthat::expect_equal(first_object, object)
     16. methods::as(tmp_frame$Var1, class(frame$Var1))
    
     ── 80. Error: Full SimulatedIncidenceMatrix : scale respects cnames ───────────
     no method or default for coercing "character" to "factor"
     Backtrace:
     1. testthat::expect_equal(first_object, object)
     16. methods::as(tmp_frame$Var1, class(frame$Var1))
    
     ── 81. Error: Full SimulatedIncidenceMatrix : scale respects rnames ───────────
     no method or default for coercing "character" to "factor"
     Backtrace:
     1. testthat::expect_equal(first_object, object)
     16. methods::as(tmp_frame$Var1, class(frame$Var1))
    
     ── 82. Error: Full SimulatedIncidenceMatrix : scale respects colData ──────────
     no method or default for coercing "character" to "factor"
     Backtrace:
     1. testthat::expect_equal(first_object, object)
     16. methods::as(tmp_frame$Var1, class(frame$Var1))
    
     ── 83. Error: Full SimulatedIncidenceMatrix : scale respects rowData ──────────
     no method or default for coercing "character" to "factor"
     Backtrace:
     1. testthat::expect_equal(first_object, object)
     16. methods::as(tmp_frame$Var1, class(frame$Var1))
    
     ── 84. Error: Full SimulatedIncidenceMatrix : scale respects metaData ─────────
     no method or default for coercing "character" to "factor"
     Backtrace:
     1. testthat::expect_equal(first_object, object)
     16. methods::as(tmp_frame$Var1, class(frame$Var1))
    
     ── 85. Error: Full SimulatedIncidenceMatrix : scale respects mat ──────────────
     no method or default for coercing "character" to "factor"
     Backtrace:
     1. testthat::expect_equal(first_object, object)
     16. methods::as(tmp_frame$Var1, class(frame$Var1))
    
     ── 86. Error: Full SimulatedIncidenceMatrix : scale respects simulations ──────
     no method or default for coercing "character" to "factor"
     Backtrace:
     1. testthat::expect_equal(first_object, object)
     16. methods::as(tmp_frame$Var1, class(frame$Var1))
    
     ── 87. Error: Full SimulatedIncidenceMatrix : scale respects arr ──────────────
     no method or default for coercing "character" to "factor"
     Backtrace:
     1. testthat::expect_equal(first_object, object)
     16. methods::as(tmp_frame$Var1, class(frame$Var1))
    
     ── 88. Error: Full SimulatedIncidenceMatrix : addError works ──────────────────
     no method or default for coercing "character" to "factor"
     Backtrace:
     1. testthat::expect_equal(first_object, object)
     16. methods::as(tmp_frame$Var1, class(frame$Var1))
    
     ── 89. Error: Full SimulatedIncidenceMatrix : addError respects ncol ──────────
     no method or default for coercing "character" to "factor"
     Backtrace:
     1. testthat::expect_equal(first_object, object)
     16. methods::as(tmp_frame$Var1, class(frame$Var1))
    
     ── 90. Error: Full SimulatedIncidenceMatrix : addError respects nrow ──────────
     no method or default for coercing "character" to "factor"
     Backtrace:
     1. testthat::expect_equal(first_object, object)
     16. methods::as(tmp_frame$Var1, class(frame$Var1))
    
     ── 91. Error: Full SimulatedIncidenceMatrix : addError respects ncol ──────────
     no method or default for coercing "character" to "factor"
     Backtrace:
     1. testthat::expect_equal(first_object, object)
     16. methods::as(tmp_frame$Var1, class(frame$Var1))
    
     ── 92. Error: Full SimulatedIncidenceMatrix : addError respects cnames ────────
     no method or default for coercing "character" to "factor"
     Backtrace:
     1. testthat::expect_equal(first_object, object)
     16. methods::as(tmp_frame$Var1, class(frame$Var1))
    
     ── 93. Error: Full SimulatedIncidenceMatrix : addError respects rnames ────────
     no method or default for coercing "character" to "factor"
     Backtrace:
     1. testthat::expect_equal(first_object, object)
     16. methods::as(tmp_frame$Var1, class(frame$Var1))
    
     ── 94. Error: Full SimulatedIncidenceMatrix : addError respects colData ───────
     no method or default for coercing "character" to "factor"
     Backtrace:
     1. testthat::expect_equal(first_object, object)
     16. methods::as(tmp_frame$Var1, class(frame$Var1))
    
     ── 95. Error: Full SimulatedIncidenceMatrix : addError respects rowData ───────
     no method or default for coercing "character" to "factor"
     Backtrace:
     1. testthat::expect_equal(first_object, object)
     16. methods::as(tmp_frame$Var1, class(frame$Var1))
    
     ── 96. Error: Full SimulatedIncidenceMatrix : addError respects metaData ──────
     no method or default for coercing "character" to "factor"
     Backtrace:
     1. testthat::expect_equal(first_object, object)
     16. methods::as(tmp_frame$Var1, class(frame$Var1))
    
     ── 97. Error: Full SimulatedIncidenceMatrix : addError respects metaData ──────
     no method or default for coercing "character" to "factor"
     Backtrace:
     1. testthat::expect_equal(first_object, object)
     16. methods::as(tmp_frame$Var1, class(frame$Var1))
    
     ── 98. Error: Full SimulatedIncidenceMatrix : addError respects nsim ──────────
     no method or default for coercing "character" to "factor"
     Backtrace:
     1. testthat::expect_equal(first_object, object)
     16. methods::as(tmp_frame$Var1, class(frame$Var1))
    
     ── 99. Error: Full SimulatedIncidenceMatrix : addError respects nsim ──────────
     no method or default for coercing "character" to "factor"
     Backtrace:
     1. testthat::expect_equal(first_object, object)
     16. methods::as(tmp_frame$Var1, class(frame$Var1))
    
     ── 100. Error: Full SimulatedIncidenceMatrix : addError respects mat ──────────
     no method or default for coercing "character" to "factor"
     Backtrace:
     1. testthat::expect_equal(first_object, object)
     16. methods::as(tmp_frame$Var1, class(frame$Var1))
    
     ── 101. Error: Full SimulatedIncidenceMatrix : addError respects simulations ──
     no method or default for coercing "character" to "factor"
     Backtrace:
     1. testthat::expect_equal(first_object, object)
     16. methods::as(tmp_frame$Var1, class(frame$Var1))
    
     ── 102. Error: Full SimulatedIncidenceMatrix : addError respects arr ──────────
     no method or default for coercing "character" to "factor"
     Backtrace:
     1. testthat::expect_equal(first_object, object)
     16. methods::as(tmp_frame$Var1, class(frame$Var1))
    
     ── 103. Error: Full SimulatedIncidenceMatrix : summarize works ────────────────
     no method or default for coercing "character" to "factor"
     Backtrace:
     1. testthat::expect_equal(first_object, object)
     16. methods::as(tmp_frame$Var1, class(frame$Var1))
    
     ── 104. Error: List SimulatedIncidenceMatrix : Active bindings have correct mode
     no method or default for coercing "character" to "factor"
     Backtrace:
     1. testthat::expect_equal(first_object, object)
     16. methods::as(tmp_frame$Var1, class(frame$Var1))
    
     ── 105. Error: List SimulatedIncidenceMatrix : tail respects mat ──────────────
     no method or default for coercing "character" to "factor"
     Backtrace:
     1. testthat::expect_equal(object, firstObject)
     16. methods::as(tmp_frame$Var1, class(frame$Var1))
    
     ── 106. Error: List SimulatedIncidenceMatrix : tail respects simulations ──────
     no method or default for coercing "character" to "factor"
     Backtrace:
     1. testthat::expect_equal(object, firstObject)
     16. methods::as(tmp_frame$Var1, class(frame$Var1))
    
     ── 107. Error: List SimulatedIncidenceMatrix : tail respects arr ──────────────
     no method or default for coercing "character" to "factor"
     Backtrace:
     1. testthat::expect_equal(object, firstObject)
     16. methods::as(tmp_frame$Var1, class(frame$Var1))
    
     ── 108. Error: List SimulatedIncidenceMatrix : mutate works ───────────────────
     no method or default for coercing "character" to "factor"
     Backtrace:
     1. testthat::expect_equal(object, firstObject)
     16. methods::as(tmp_frame$Var1, class(frame$Var1))
    
     ── 109. Error: List SimulatedIncidenceMatrix : subset respects mat ────────────
     no method or default for coercing "character" to "factor"
     Backtrace:
     1. testthat::expect_equal(object, firstObject)
     16. methods::as(tmp_frame$Var1, class(frame$Var1))
    
     ── 110. Error: List SimulatedIncidenceMatrix : subset respects simulations ────
     no method or default for coercing "character" to "factor"
     Backtrace:
     1. testthat::expect_equal(object, firstObject)
     16. methods::as(tmp_frame$Var1, class(frame$Var1))
    
     ── 111. Error: List SimulatedIncidenceMatrix : subset respects arr ────────────
     no method or default for coercing "character" to "factor"
     Backtrace:
     1. testthat::expect_equal(object, firstObject)
     16. methods::as(tmp_frame$Var1, class(frame$Var1))
    
     ── 112. Error: List SimulatedIncidenceMatrix : mutate works ───────────────────
     no method or default for coercing "character" to "factor"
     Backtrace:
     1. testthat::expect_equal(object, firstObject)
     16. methods::as(tmp_frame$Var1, class(frame$Var1))
    
     ── 113. Error: List SimulatedIncidenceMatrix : subset respects mat ────────────
     no method or default for coercing "character" to "factor"
     Backtrace:
     1. testthat::expect_equal(object, firstObject)
     16. methods::as(tmp_frame$Var1, class(frame$Var1))
    
     ── 114. Error: List SimulatedIncidenceMatrix : subset respects simulations ────
     no method or default for coercing "character" to "factor"
     Backtrace:
     1. testthat::expect_equal(object, firstObject)
     16. methods::as(tmp_frame$Var1, class(frame$Var1))
    
     ── 115. Error: List SimulatedIncidenceMatrix : subset respects arr ────────────
     no method or default for coercing "character" to "factor"
     Backtrace:
     1. testthat::expect_equal(object, firstObject)
     16. methods::as(tmp_frame$Var1, class(frame$Var1))
    
     ── 116. Error: List SimulatedIncidenceMatrix : addColumns respects mat ────────
     no method or default for coercing "character" to "factor"
     Backtrace:
     1. testthat::expect_equal(object, firstObject)
     16. methods::as(tmp_frame$Var1, class(frame$Var1))
    
     ── 117. Error: List SimulatedIncidenceMatrix : addColumns respects simulations
     no method or default for coercing "character" to "factor"
     Backtrace:
     1. testthat::expect_equal(object, firstObject)
     16. methods::as(tmp_frame$Var1, class(frame$Var1))
    
     ── 118. Error: List SimulatedIncidenceMatrix : addColumns respects arr ────────
     no method or default for coercing "character" to "factor"
     Backtrace:
     1. testthat::expect_equal(object, firstObject)
     16. methods::as(tmp_frame$Var1, class(frame$Var1))
    
     ── 119. Error: List SimulatedIncidenceMatrix : addRows respects mat ───────────
     no method or default for coercing "character" to "factor"
     Backtrace:
     1. testthat::expect_equal(object, firstObject)
     16. methods::as(tmp_frame$Var1, class(frame$Var1))
    
     ── 120. Error: List SimulatedIncidenceMatrix : addRows respects simulations ───
     no method or default for coercing "character" to "factor"
     Backtrace:
     1. testthat::expect_equal(object, firstObject)
     16. methods::as(tmp_frame$Var1, class(frame$Var1))
    
     ── 121. Error: List SimulatedIncidenceMatrix : addRows respects arr ───────────
     no method or default for coercing "character" to "factor"
     Backtrace:
     1. testthat::expect_equal(object, firstObject)
     16. methods::as(tmp_frame$Var1, class(frame$Var1))
    
     ── 122. Error: List SimulatedIncidenceMatrix : diff works ─────────────────────
     no method or default for coercing "character" to "factor"
     Backtrace:
     1. testthat::expect_equal(object, first_object)
     16. methods::as(tmp_frame$Var1, class(frame$Var1))
    
     ── 123. Error: List SimulatedIncidenceMatrix : diff respects cnames ───────────
     no method or default for coercing "character" to "factor"
     Backtrace:
     1. testthat::expect_equal(object, first_object)
     16. methods::as(tmp_frame$Var1, class(frame$Var1))
    
     ── 124. Error: List SimulatedIncidenceMatrix : diff respects ncol ─────────────
     no method or default for coercing "character" to "factor"
     Backtrace:
     1. testthat::expect_equal(object, first_object)
     16. methods::as(tmp_frame$Var1, class(frame$Var1))
    
     ── 125. Error: List SimulatedIncidenceMatrix : diff respects nsim ─────────────
     no method or default for coercing "character" to "factor"
     Backtrace:
     1. testthat::expect_equal(object, first_object)
     16. methods::as(tmp_frame$Var1, class(frame$Var1))
    
     ── 126. Error: List SimulatedIncidenceMatrix : diff respects nrow ─────────────
     no method or default for coercing "character" to "factor"
     Backtrace:
     1. testthat::expect_equal(object, first_object)
     16. methods::as(tmp_frame$Var1, class(frame$Var1))
    
     ── 127. Error: List SimulatedIncidenceMatrix : diff respects rnames ───────────
     no method or default for coercing "character" to "factor"
     Backtrace:
     1. testthat::expect_equal(object, first_object)
     16. methods::as(tmp_frame$Var1, class(frame$Var1))
    
     ── 128. Error: List SimulatedIncidenceMatrix : diff respects colData ──────────
     no method or default for coercing "character" to "factor"
     Backtrace:
     1. testthat::expect_equal(object, first_object)
     16. methods::as(tmp_frame$Var1, class(frame$Var1))
    
     ── 129. Error: List SimulatedIncidenceMatrix : diff respects mat ──────────────
     no method or default for coercing "character" to "factor"
     Backtrace:
     1. testthat::expect_equal(object, first_object)
     16. methods::as(tmp_frame$Var1, class(frame$Var1))
    
     ── 130. Error: List SimulatedIncidenceMatrix : diff respects simulations ──────
     no method or default for coercing "character" to "factor"
     Backtrace:
     1. testthat::expect_equal(object, first_object)
     16. methods::as(tmp_frame$Var1, class(frame$Var1))
    
     ── 131. Error: List SimulatedIncidenceMatrix : diff respects arr ──────────────
     no method or default for coercing "character" to "factor"
     Backtrace:
     1. testthat::expect_equal(object, first_object)
     16. methods::as(tmp_frame$Var1, class(frame$Var1))
    
     ── 132. Error: List SimulatedIncidenceMatrix : diff respects metaData ─────────
     no method or default for coercing "character" to "factor"
     Backtrace:
     1. testthat::expect_equal(object, first_object)
     16. methods::as(tmp_frame$Var1, class(frame$Var1))
    
     ── 133. Error: List SimulatedIncidenceMatrix : diff respects rowData ──────────
     no method or default for coercing "character" to "factor"
     Backtrace:
     1. testthat::expect_equal(object, first_object)
     16. methods::as(tmp_frame$Var1, class(frame$Var1))
    
     ── 134. Error: List SimulatedIncidenceMatrix : head respects mat ──────────────
     no method or default for coercing "character" to "factor"
     Backtrace:
     1. testthat::expect_equal(object, firstObject)
     16. methods::as(tmp_frame$Var1, class(frame$Var1))
    
     ── 135. Error: List SimulatedIncidenceMatrix : head respects simulations ──────
     no method or default for coercing "character" to "factor"
     Backtrace:
     1. testthat::expect_equal(object, firstObject)
     16. methods::as(tmp_frame$Var1, class(frame$Var1))
    
     ── 136. Error: List SimulatedIncidenceMatrix : head respects arr ──────────────
     no method or default for coercing "character" to "factor"
     Backtrace:
     1. testthat::expect_equal(object, firstObject)
     16. methods::as(tmp_frame$Var1, class(frame$Var1))
    
     ── 137. Error: List SimulatedIncidenceMatrix : scale works ────────────────────
     no method or default for coercing "character" to "factor"
     Backtrace:
     1. testthat::expect_equal(first_object, object)
     16. methods::as(tmp_frame$Var1, class(frame$Var1))
    
     ── 138. Error: List SimulatedIncidenceMatrix : scale respects nrow ────────────
     no method or default for coercing "character" to "factor"
     Backtrace:
     1. testthat::expect_equal(first_object, object)
     16. methods::as(tmp_frame$Var1, class(frame$Var1))
    
     ── 139. Error: List SimulatedIncidenceMatrix : scale respects ncol ────────────
     no method or default for coercing "character" to "factor"
     Backtrace:
     1. testthat::expect_equal(first_object, object)
     16. methods::as(tmp_frame$Var1, class(frame$Var1))
    
     ── 140. Error: List SimulatedIncidenceMatrix : scale respects nsim ────────────
     no method or default for coercing "character" to "factor"
     Backtrace:
     1. testthat::expect_equal(first_object, object)
     16. methods::as(tmp_frame$Var1, class(frame$Var1))
    
     ── 141. Error: List SimulatedIncidenceMatrix : scale respects cnames ──────────
     no method or default for coercing "character" to "factor"
     Backtrace:
     1. testthat::expect_equal(first_object, object)
     16. methods::as(tmp_frame$Var1, class(frame$Var1))
    
     ── 142. Error: List SimulatedIncidenceMatrix : scale respects rnames ──────────
     no method or default for coercing "character" to "factor"
     Backtrace:
     1. testthat::expect_equal(first_object, object)
     16. methods::as(tmp_frame$Var1, class(frame$Var1))
    
     ── 143. Error: List SimulatedIncidenceMatrix : scale respects colData ─────────
     no method or default for coercing "character" to "factor"
     Backtrace:
     1. testthat::expect_equal(first_object, object)
     16. methods::as(tmp_frame$Var1, class(frame$Var1))
    
     ── 144. Error: List SimulatedIncidenceMatrix : scale respects rowData ─────────
     no method or default for coercing "character" to "factor"
     Backtrace:
     1. testthat::expect_equal(first_object, object)
     16. methods::as(tmp_frame$Var1, class(frame$Var1))
    
     ── 145. Error: List SimulatedIncidenceMatrix : scale respects metaData ────────
     no method or default for coercing "character" to "factor"
     Backtrace:
     1. testthat::expect_equal(first_object, object)
     16. methods::as(tmp_frame$Var1, class(frame$Var1))
    
     ── 146. Error: List SimulatedIncidenceMatrix : scale respects mat ─────────────
     no method or default for coercing "character" to "factor"
     Backtrace:
     1. testthat::expect_equal(first_object, object)
     16. methods::as(tmp_frame$Var1, class(frame$Var1))
    
     ── 147. Error: List SimulatedIncidenceMatrix : scale respects simulations ─────
     no method or default for coercing "character" to "factor"
     Backtrace:
     1. testthat::expect_equal(first_object, object)
     16. methods::as(tmp_frame$Var1, class(frame$Var1))
    
     ── 148. Error: List SimulatedIncidenceMatrix : scale respects arr ─────────────
     no method or default for coercing "character" to "factor"
     Backtrace:
     1. testthat::expect_equal(first_object, object)
     16. methods::as(tmp_frame$Var1, class(frame$Var1))
    
     ── 149. Error: List SimulatedIncidenceMatrix : addError works ─────────────────
     no method or default for coercing "character" to "factor"
     Backtrace:
     1. testthat::expect_equal(first_object, object)
     16. methods::as(tmp_frame$Var1, class(frame$Var1))
    
     ── 150. Error: List SimulatedIncidenceMatrix : addError respects ncol ─────────
     no method or default for coercing "character" to "factor"
     Backtrace:
     1. testthat::expect_equal(first_object, object)
     16. methods::as(tmp_frame$Var1, class(frame$Var1))
    
     ── 151. Error: List SimulatedIncidenceMatrix : addError respects nrow ─────────
     no method or default for coercing "character" to "factor"
     Backtrace:
     1. testthat::expect_equal(first_object, object)
     16. methods::as(tmp_frame$Var1, class(frame$Var1))
    
     ── 152. Error: List SimulatedIncidenceMatrix : addError respects ncol ─────────
     no method or default for coercing "character" to "factor"
     Backtrace:
     1. testthat::expect_equal(first_object, object)
     16. methods::as(tmp_frame$Var1, class(frame$Var1))
    
     ── 153. Error: List SimulatedIncidenceMatrix : addError respects cnames ───────
     no method or default for coercing "character" to "factor"
     Backtrace:
     1. testthat::expect_equal(first_object, object)
     16. methods::as(tmp_frame$Var1, class(frame$Var1))
    
     ── 154. Error: List SimulatedIncidenceMatrix : addError respects rnames ───────
     no method or default for coercing "character" to "factor"
     Backtrace:
     1. testthat::expect_equal(first_object, object)
     16. methods::as(tmp_frame$Var1, class(frame$Var1))
    
     ── 155. Error: List SimulatedIncidenceMatrix : addError respects colData ──────
     no method or default for coercing "character" to "factor"
     Backtrace:
     1. testthat::expect_equal(first_object, object)
     16. methods::as(tmp_frame$Var1, class(frame$Var1))
    
     ── 156. Error: List SimulatedIncidenceMatrix : addError respects rowData ──────
     no method or default for coercing "character" to "factor"
     Backtrace:
     1. testthat::expect_equal(first_object, object)
     16. methods::as(tmp_frame$Var1, class(frame$Var1))
    
     ── 157. Error: List SimulatedIncidenceMatrix : addError respects metaData ─────
     no method or default for coercing "character" to "factor"
     Backtrace:
     1. testthat::expect_equal(first_object, object)
     16. methods::as(tmp_frame$Var1, class(frame$Var1))
    
     ── 158. Error: List SimulatedIncidenceMatrix : addError respects metaData ─────
     no method or default for coercing "character" to "factor"
     Backtrace:
     1. testthat::expect_equal(first_object, object)
     16. methods::as(tmp_frame$Var1, class(frame$Var1))
    
     ── 159. Error: List SimulatedIncidenceMatrix : addError respects nsim ─────────
     no method or default for coercing "character" to "factor"
     Backtrace:
     1. testthat::expect_equal(first_object, object)
     16. methods::as(tmp_frame$Var1, class(frame$Var1))
    
     ── 160. Error: List SimulatedIncidenceMatrix : addError respects nsim ─────────
     no method or default for coercing "character" to "factor"
     Backtrace:
     1. testthat::expect_equal(first_object, object)
     16. methods::as(tmp_frame$Var1, class(frame$Var1))
    
     ── 161. Error: List SimulatedIncidenceMatrix : addError respects mat ──────────
     no method or default for coercing "character" to "factor"
     Backtrace:
     1. testthat::expect_equal(first_object, object)
     16. methods::as(tmp_frame$Var1, class(frame$Var1))
    
     ── 162. Error: List SimulatedIncidenceMatrix : addError respects simulations ──
     no method or default for coercing "character" to "factor"
     Backtrace:
     1. testthat::expect_equal(first_object, object)
     16. methods::as(tmp_frame$Var1, class(frame$Var1))
    
     ── 163. Error: List SimulatedIncidenceMatrix : addError respects arr ──────────
     no method or default for coercing "character" to "factor"
     Backtrace:
     1. testthat::expect_equal(first_object, object)
     16. methods::as(tmp_frame$Var1, class(frame$Var1))
    
     ── 164. Error: List SimulatedIncidenceMatrix : summarize works ────────────────
     no method or default for coercing "character" to "factor"
     Backtrace:
     1. testthat::expect_equal(first_object, object)
     16. methods::as(tmp_frame$Var1, class(frame$Var1))
    
     ── 165. Error: Full IncidenceForecast : mean works ────────────────────────────
     no method or default for coercing "character" to "factor"
     Backtrace:
     1. testthat::expect_that(...)
     20. methods::as(tmp_frame$Var1, class(frame$Var1))
    
     ── 166. Error: Full IncidenceForecast : median works ──────────────────────────
     no method or default for coercing "character" to "factor"
     Backtrace:
     1. testthat::expect_that(...)
     20. methods::as(tmp_frame$Var1, class(frame$Var1))
    
     ── 167. Error: Full IncidenceForecast : Inherited Methods don't change object ─
     no method or default for coercing "character" to "factor"
     Backtrace:
     1. equivalence(first_object)(object)
     19. methods::as(tmp_frame$Var1, class(frame$Var1))
    
     ── 168. Error: Full IncidenceForecast : sample works ──────────────────────────
     no method or default for coercing "character" to "factor"
     Backtrace:
     1. testthat::expect_that(first_object, equals(object))
     28. methods::as(tmp_frame$Var1, class(frame$Var1))
    
     ══ testthat results ═══════════════════════════════════════════════════════════
     [ OK: 10173 | SKIPPED: 207 | WARNINGS: 123 | FAILED: 168 ]
     1. Error: Full IncidenceMatrix : Active bindings have correct mode.
     2. Error: Full IncidenceMatrix : tail respects mat
     3. Error: Full IncidenceMatrix : mutate works
     4. Error: Full IncidenceMatrix : mutate respects nrow
     5. Error: Full IncidenceMatrix : mutate respects ncol
     6. Error: Full IncidenceMatrix : mutate respects rnames
     7. Error: Full IncidenceMatrix : mutate respects cnames
     8. Error: Full IncidenceMatrix : mutate respects metaData
     9. Error: Full IncidenceMatrix : mutate respects rowData
     1. ...
    
     Error: testthat unit tests failed
     Execution halted
Flavor: r-devel-linux-x86_64-fedora-gcc

Version: 0.10.3
Check: tests
Result: ERROR
     Running 'testthat.R' [245s]
    Running the tests in 'tests/testthat.R' failed.
    Complete output:
     > library(testthat)
     > test_check("ForecastFramework")
     Loading required package: ForecastFramework
     Loading required package: R6
     -- 1. Error: Full IncidenceMatrix : Active bindings have correct mode. --------
     argument is of length zero
     Backtrace:
    
     -- 2. Error: Full IncidenceMatrix : tail respects mat -------------------------
     argument is of length zero
     Backtrace:
    
     -- 3. Error: Full IncidenceMatrix : mutate works ------------------------------
     argument is of length zero
     Backtrace:
    
     -- 4. Error: Full IncidenceMatrix : mutate respects nrow ----------------------
     argument is of length zero
     Backtrace:
    
     -- 5. Error: Full IncidenceMatrix : mutate respects ncol ----------------------
     argument is of length zero
     Backtrace:
    
     -- 6. Error: Full IncidenceMatrix : mutate respects rnames --------------------
     argument is of length zero
     Backtrace:
    
     -- 7. Error: Full IncidenceMatrix : mutate respects cnames --------------------
     argument is of length zero
     Backtrace:
    
     -- 8. Error: Full IncidenceMatrix : mutate respects metaData ------------------
     argument is of length zero
     Backtrace:
    
     -- 9. Error: Full IncidenceMatrix : mutate respects rowData -------------------
     argument is of length zero
     Backtrace:
    
     -- 10. Error: Full IncidenceMatrix : mutate respects colData ------------------
     argument is of length zero
     Backtrace:
    
     -- 11. Error: Full IncidenceMatrix : subset respects mat ----------------------
     argument is of length zero
     Backtrace:
    
     -- 12. Error: Full IncidenceMatrix : mutate works -----------------------------
     argument is of length zero
     Backtrace:
    
     -- 13. Error: Full IncidenceMatrix : mutate respects nrow ---------------------
     argument is of length zero
     Backtrace:
    
     -- 14. Error: Full IncidenceMatrix : mutate respects ncol ---------------------
     argument is of length zero
     Backtrace:
    
     -- 15. Error: Full IncidenceMatrix : mutate respects rnames -------------------
     argument is of length zero
     Backtrace:
    
     -- 16. Error: Full IncidenceMatrix : mutate respects cnames -------------------
     argument is of length zero
     Backtrace:
    
     -- 17. Error: Full IncidenceMatrix : mutate respects metaData -----------------
     argument is of length zero
     Backtrace:
    
     -- 18. Error: Full IncidenceMatrix : mutate respects rowData ------------------
     argument is of length zero
     Backtrace:
    
     -- 19. Error: Full IncidenceMatrix : mutate respects colData ------------------
     argument is of length zero
     Backtrace:
    
     -- 20. Error: Full IncidenceMatrix : subset respects mat ----------------------
     argument is of length zero
     Backtrace:
    
     -- 21. Error: Full IncidenceMatrix : addColumns respects mat ------------------
     argument is of length zero
     Backtrace:
    
     -- 22. Error: Full IncidenceMatrix : addRows respects mat ---------------------
     argument is of length zero
     Backtrace:
    
     -- 23. Error: Full IncidenceMatrix : mutate respects mat ----------------------
     argument is of length zero
     Backtrace:
    
     -- 24. Error: Full IncidenceMatrix : diff works -------------------------------
     argument is of length zero
     Backtrace:
    
     -- 25. Error: Full IncidenceMatrix : diff respects ncol -----------------------
     argument is of length zero
     Backtrace:
    
     -- 26. Error: Full IncidenceMatrix : diff respects nrow -----------------------
     argument is of length zero
     Backtrace:
    
     -- 27. Error: Full IncidenceMatrix : diff respects rnames ---------------------
     argument is of length zero
     Backtrace:
    
     -- 28. Error: Full IncidenceMatrix : diff respects cnames ---------------------
     argument is of length zero
     Backtrace:
    
     -- 29. Error: Full IncidenceMatrix : diff respects colData --------------------
     argument is of length zero
     Backtrace:
    
     -- 30. Error: Full IncidenceMatrix : diff respects mat ------------------------
     argument is of length zero
     Backtrace:
    
     -- 31. Error: Full IncidenceMatrix : diff respects metaData -------------------
     argument is of length zero
     Backtrace:
    
     -- 32. Error: Full IncidenceMatrix : diff respects rowData --------------------
     argument is of length zero
     Backtrace:
    
     -- 33. Error: Full IncidenceMatrix : head respects mat ------------------------
     argument is of length zero
     Backtrace:
    
     -- 34. Error: Full IncidenceMatrix : scale works ------------------------------
     argument is of length zero
     Backtrace:
    
     -- 35. Error: Full IncidenceMatrix : scale respects nrow ----------------------
     argument is of length zero
     Backtrace:
    
     -- 36. Error: Full IncidenceMatrix : scale respects ncol ----------------------
     argument is of length zero
     Backtrace:
    
     -- 37. Error: Full IncidenceMatrix : scale respects cnames --------------------
     argument is of length zero
     Backtrace:
    
     -- 38. Error: Full IncidenceMatrix : scale respects rnames --------------------
     argument is of length zero
     Backtrace:
    
     -- 39. Error: Full IncidenceMatrix : scale respects colData -------------------
     argument is of length zero
     Backtrace:
    
     -- 40. Error: Full IncidenceMatrix : scale respects rowData -------------------
     argument is of length zero
     Backtrace:
    
     -- 41. Error: Full IncidenceMatrix : scale respects metaData ------------------
     argument is of length zero
     Backtrace:
    
     -- 42. Error: Full IncidenceMatrix : scale respects mat -----------------------
     argument is of length zero
     Backtrace:
    
     -- 43. Error: Full SimulatedIncidenceMatrix : Active bindings have correct mode.
     no method or default for coercing "character" to "factor"
     Backtrace:
     1. testthat::expect_equal(first_object, object)
     16. methods::as(tmp_frame$Var1, class(frame$Var1))
    
     -- 44. Error: Full SimulatedIncidenceMatrix : tail respects mat ---------------
     no method or default for coercing "character" to "factor"
     Backtrace:
     1. testthat::expect_equal(object, firstObject)
     16. methods::as(tmp_frame$Var1, class(frame$Var1))
    
     -- 45. Error: Full SimulatedIncidenceMatrix : tail respects simulations -------
     no method or default for coercing "character" to "factor"
     Backtrace:
     1. testthat::expect_equal(object, firstObject)
     16. methods::as(tmp_frame$Var1, class(frame$Var1))
    
     -- 46. Error: Full SimulatedIncidenceMatrix : tail respects arr ---------------
     no method or default for coercing "character" to "factor"
     Backtrace:
     1. testthat::expect_equal(object, firstObject)
     16. methods::as(tmp_frame$Var1, class(frame$Var1))
    
     -- 47. Error: Full SimulatedIncidenceMatrix : mutate works --------------------
     no method or default for coercing "character" to "factor"
     Backtrace:
     1. testthat::expect_equal(object, firstObject)
     16. methods::as(tmp_frame$Var1, class(frame$Var1))
    
     -- 48. Error: Full SimulatedIncidenceMatrix : subset respects mat -------------
     no method or default for coercing "character" to "factor"
     Backtrace:
     1. testthat::expect_equal(object, firstObject)
     16. methods::as(tmp_frame$Var1, class(frame$Var1))
    
     -- 49. Error: Full SimulatedIncidenceMatrix : subset respects simulations -----
     no method or default for coercing "character" to "factor"
     Backtrace:
     1. testthat::expect_equal(object, firstObject)
     16. methods::as(tmp_frame$Var1, class(frame$Var1))
    
     -- 50. Error: Full SimulatedIncidenceMatrix : subset respects arr -------------
     no method or default for coercing "character" to "factor"
     Backtrace:
     1. testthat::expect_equal(object, firstObject)
     16. methods::as(tmp_frame$Var1, class(frame$Var1))
    
     -- 51. Error: Full SimulatedIncidenceMatrix : mutate works --------------------
     no method or default for coercing "character" to "factor"
     Backtrace:
     1. testthat::expect_equal(object, firstObject)
     16. methods::as(tmp_frame$Var1, class(frame$Var1))
    
     -- 52. Error: Full SimulatedIncidenceMatrix : subset respects mat -------------
     no method or default for coercing "character" to "factor"
     Backtrace:
     1. testthat::expect_equal(object, firstObject)
     16. methods::as(tmp_frame$Var1, class(frame$Var1))
    
     -- 53. Error: Full SimulatedIncidenceMatrix : subset respects simulations -----
     no method or default for coercing "character" to "factor"
     Backtrace:
     1. testthat::expect_equal(object, firstObject)
     16. methods::as(tmp_frame$Var1, class(frame$Var1))
    
     -- 54. Error: Full SimulatedIncidenceMatrix : subset respects arr -------------
     no method or default for coercing "character" to "factor"
     Backtrace:
     1. testthat::expect_equal(object, firstObject)
     16. methods::as(tmp_frame$Var1, class(frame$Var1))
    
     -- 55. Error: Full SimulatedIncidenceMatrix : addColumns respects mat ---------
     no method or default for coercing "character" to "factor"
     Backtrace:
     1. testthat::expect_equal(object, firstObject)
     16. methods::as(tmp_frame$Var1, class(frame$Var1))
    
     -- 56. Error: Full SimulatedIncidenceMatrix : addColumns respects simulations -
     no method or default for coercing "character" to "factor"
     Backtrace:
     1. testthat::expect_equal(object, firstObject)
     16. methods::as(tmp_frame$Var1, class(frame$Var1))
    
     -- 57. Error: Full SimulatedIncidenceMatrix : addColumns respects arr ---------
     no method or default for coercing "character" to "factor"
     Backtrace:
     1. testthat::expect_equal(object, firstObject)
     16. methods::as(tmp_frame$Var1, class(frame$Var1))
    
     -- 58. Error: Full SimulatedIncidenceMatrix : addRows respects mat ------------
     no method or default for coercing "character" to "factor"
     Backtrace:
     1. testthat::expect_equal(object, firstObject)
     16. methods::as(tmp_frame$Var1, class(frame$Var1))
    
     -- 59. Error: Full SimulatedIncidenceMatrix : addRows respects simulations ----
     no method or default for coercing "character" to "factor"
     Backtrace:
     1. testthat::expect_equal(object, firstObject)
     16. methods::as(tmp_frame$Var1, class(frame$Var1))
    
     -- 60. Error: Full SimulatedIncidenceMatrix : addRows respects arr ------------
     no method or default for coercing "character" to "factor"
     Backtrace:
     1. testthat::expect_equal(object, firstObject)
     16. methods::as(tmp_frame$Var1, class(frame$Var1))
    
     -- 61. Error: Full SimulatedIncidenceMatrix : diff works ----------------------
     no method or default for coercing "character" to "factor"
     Backtrace:
     1. testthat::expect_equal(object, first_object)
     16. methods::as(tmp_frame$Var1, class(frame$Var1))
    
     -- 62. Error: Full SimulatedIncidenceMatrix : diff respects cnames ------------
     no method or default for coercing "character" to "factor"
     Backtrace:
     1. testthat::expect_equal(object, first_object)
     16. methods::as(tmp_frame$Var1, class(frame$Var1))
    
     -- 63. Error: Full SimulatedIncidenceMatrix : diff respects ncol --------------
     no method or default for coercing "character" to "factor"
     Backtrace:
     1. testthat::expect_equal(object, first_object)
     16. methods::as(tmp_frame$Var1, class(frame$Var1))
    
     -- 64. Error: Full SimulatedIncidenceMatrix : diff respects nsim --------------
     no method or default for coercing "character" to "factor"
     Backtrace:
     1. testthat::expect_equal(object, first_object)
     16. methods::as(tmp_frame$Var1, class(frame$Var1))
    
     -- 65. Error: Full SimulatedIncidenceMatrix : diff respects nrow --------------
     no method or default for coercing "character" to "factor"
     Backtrace:
     1. testthat::expect_equal(object, first_object)
     16. methods::as(tmp_frame$Var1, class(frame$Var1))
    
     -- 66. Error: Full SimulatedIncidenceMatrix : diff respects rnames ------------
     no method or default for coercing "character" to "factor"
     Backtrace:
     1. testthat::expect_equal(object, first_object)
     16. methods::as(tmp_frame$Var1, class(frame$Var1))
    
     -- 67. Error: Full SimulatedIncidenceMatrix : diff respects colData -----------
     no method or default for coercing "character" to "factor"
     Backtrace:
     1. testthat::expect_equal(object, first_object)
     16. methods::as(tmp_frame$Var1, class(frame$Var1))
    
     -- 68. Error: Full SimulatedIncidenceMatrix : diff respects mat ---------------
     no method or default for coercing "character" to "factor"
     Backtrace:
     1. testthat::expect_equal(object, first_object)
     16. methods::as(tmp_frame$Var1, class(frame$Var1))
    
     -- 69. Error: Full SimulatedIncidenceMatrix : diff respects simulations -------
     no method or default for coercing "character" to "factor"
     Backtrace:
     1. testthat::expect_equal(object, first_object)
     16. methods::as(tmp_frame$Var1, class(frame$Var1))
    
     -- 70. Error: Full SimulatedIncidenceMatrix : diff respects arr ---------------
     no method or default for coercing "character" to "factor"
     Backtrace:
     1. testthat::expect_equal(object, first_object)
     16. methods::as(tmp_frame$Var1, class(frame$Var1))
    
     -- 71. Error: Full SimulatedIncidenceMatrix : diff respects metaData ----------
     no method or default for coercing "character" to "factor"
     Backtrace:
     1. testthat::expect_equal(object, first_object)
     16. methods::as(tmp_frame$Var1, class(frame$Var1))
    
     -- 72. Error: Full SimulatedIncidenceMatrix : diff respects rowData -----------
     no method or default for coercing "character" to "factor"
     Backtrace:
     1. testthat::expect_equal(object, first_object)
     16. methods::as(tmp_frame$Var1, class(frame$Var1))
    
     -- 73. Error: Full SimulatedIncidenceMatrix : head respects mat ---------------
     no method or default for coercing "character" to "factor"
     Backtrace:
     1. testthat::expect_equal(object, firstObject)
     16. methods::as(tmp_frame$Var1, class(frame$Var1))
    
     -- 74. Error: Full SimulatedIncidenceMatrix : head respects simulations -------
     no method or default for coercing "character" to "factor"
     Backtrace:
     1. testthat::expect_equal(object, firstObject)
     16. methods::as(tmp_frame$Var1, class(frame$Var1))
    
     -- 75. Error: Full SimulatedIncidenceMatrix : head respects arr ---------------
     no method or default for coercing "character" to "factor"
     Backtrace:
     1. testthat::expect_equal(object, firstObject)
     16. methods::as(tmp_frame$Var1, class(frame$Var1))
    
     -- 76. Error: Full SimulatedIncidenceMatrix : scale works ---------------------
     no method or default for coercing "character" to "factor"
     Backtrace:
     1. testthat::expect_equal(first_object, object)
     16. methods::as(tmp_frame$Var1, class(frame$Var1))
    
     -- 77. Error: Full SimulatedIncidenceMatrix : scale respects nrow -------------
     no method or default for coercing "character" to "factor"
     Backtrace:
     1. testthat::expect_equal(first_object, object)
     16. methods::as(tmp_frame$Var1, class(frame$Var1))
    
     -- 78. Error: Full SimulatedIncidenceMatrix : scale respects ncol -------------
     no method or default for coercing "character" to "factor"
     Backtrace:
     1. testthat::expect_equal(first_object, object)
     16. methods::as(tmp_frame$Var1, class(frame$Var1))
    
     -- 79. Error: Full SimulatedIncidenceMatrix : scale respects nsim -------------
     no method or default for coercing "character" to "factor"
     Backtrace:
     1. testthat::expect_equal(first_object, object)
     16. methods::as(tmp_frame$Var1, class(frame$Var1))
    
     -- 80. Error: Full SimulatedIncidenceMatrix : scale respects cnames -----------
     no method or default for coercing "character" to "factor"
     Backtrace:
     1. testthat::expect_equal(first_object, object)
     16. methods::as(tmp_frame$Var1, class(frame$Var1))
    
     -- 81. Error: Full SimulatedIncidenceMatrix : scale respects rnames -----------
     no method or default for coercing "character" to "factor"
     Backtrace:
     1. testthat::expect_equal(first_object, object)
     16. methods::as(tmp_frame$Var1, class(frame$Var1))
    
     -- 82. Error: Full SimulatedIncidenceMatrix : scale respects colData ----------
     no method or default for coercing "character" to "factor"
     Backtrace:
     1. testthat::expect_equal(first_object, object)
     16. methods::as(tmp_frame$Var1, class(frame$Var1))
    
     -- 83. Error: Full SimulatedIncidenceMatrix : scale respects rowData ----------
     no method or default for coercing "character" to "factor"
     Backtrace:
     1. testthat::expect_equal(first_object, object)
     16. methods::as(tmp_frame$Var1, class(frame$Var1))
    
     -- 84. Error: Full SimulatedIncidenceMatrix : scale respects metaData ---------
     no method or default for coercing "character" to "factor"
     Backtrace:
     1. testthat::expect_equal(first_object, object)
     16. methods::as(tmp_frame$Var1, class(frame$Var1))
    
     -- 85. Error: Full SimulatedIncidenceMatrix : scale respects mat --------------
     no method or default for coercing "character" to "factor"
     Backtrace:
     1. testthat::expect_equal(first_object, object)
     16. methods::as(tmp_frame$Var1, class(frame$Var1))
    
     -- 86. Error: Full SimulatedIncidenceMatrix : scale respects simulations ------
     no method or default for coercing "character" to "factor"
     Backtrace:
     1. testthat::expect_equal(first_object, object)
     16. methods::as(tmp_frame$Var1, class(frame$Var1))
    
     -- 87. Error: Full SimulatedIncidenceMatrix : scale respects arr --------------
     no method or default for coercing "character" to "factor"
     Backtrace:
     1. testthat::expect_equal(first_object, object)
     16. methods::as(tmp_frame$Var1, class(frame$Var1))
    
     -- 88. Error: Full SimulatedIncidenceMatrix : addError works ------------------
     no method or default for coercing "character" to "factor"
     Backtrace:
     1. testthat::expect_equal(first_object, object)
     16. methods::as(tmp_frame$Var1, class(frame$Var1))
    
     -- 89. Error: Full SimulatedIncidenceMatrix : addError respects ncol ----------
     no method or default for coercing "character" to "factor"
     Backtrace:
     1. testthat::expect_equal(first_object, object)
     16. methods::as(tmp_frame$Var1, class(frame$Var1))
    
     -- 90. Error: Full SimulatedIncidenceMatrix : addError respects nrow ----------
     no method or default for coercing "character" to "factor"
     Backtrace:
     1. testthat::expect_equal(first_object, object)
     16. methods::as(tmp_frame$Var1, class(frame$Var1))
    
     -- 91. Error: Full SimulatedIncidenceMatrix : addError respects ncol ----------
     no method or default for coercing "character" to "factor"
     Backtrace:
     1. testthat::expect_equal(first_object, object)
     16. methods::as(tmp_frame$Var1, class(frame$Var1))
    
     -- 92. Error: Full SimulatedIncidenceMatrix : addError respects cnames --------
     no method or default for coercing "character" to "factor"
     Backtrace:
     1. testthat::expect_equal(first_object, object)
     16. methods::as(tmp_frame$Var1, class(frame$Var1))
    
     -- 93. Error: Full SimulatedIncidenceMatrix : addError respects rnames --------
     no method or default for coercing "character" to "factor"
     Backtrace:
     1. testthat::expect_equal(first_object, object)
     16. methods::as(tmp_frame$Var1, class(frame$Var1))
    
     -- 94. Error: Full SimulatedIncidenceMatrix : addError respects colData -------
     no method or default for coercing "character" to "factor"
     Backtrace:
     1. testthat::expect_equal(first_object, object)
     16. methods::as(tmp_frame$Var1, class(frame$Var1))
    
     -- 95. Error: Full SimulatedIncidenceMatrix : addError respects rowData -------
     no method or default for coercing "character" to "factor"
     Backtrace:
     1. testthat::expect_equal(first_object, object)
     16. methods::as(tmp_frame$Var1, class(frame$Var1))
    
     -- 96. Error: Full SimulatedIncidenceMatrix : addError respects metaData ------
     no method or default for coercing "character" to "factor"
     Backtrace:
     1. testthat::expect_equal(first_object, object)
     16. methods::as(tmp_frame$Var1, class(frame$Var1))
    
     -- 97. Error: Full SimulatedIncidenceMatrix : addError respects metaData ------
     no method or default for coercing "character" to "factor"
     Backtrace:
     1. testthat::expect_equal(first_object, object)
     16. methods::as(tmp_frame$Var1, class(frame$Var1))
    
     -- 98. Error: Full SimulatedIncidenceMatrix : addError respects nsim ----------
     no method or default for coercing "character" to "factor"
     Backtrace:
     1. testthat::expect_equal(first_object, object)
     16. methods::as(tmp_frame$Var1, class(frame$Var1))
    
     -- 99. Error: Full SimulatedIncidenceMatrix : addError respects nsim ----------
     no method or default for coercing "character" to "factor"
     Backtrace:
     1. testthat::expect_equal(first_object, object)
     16. methods::as(tmp_frame$Var1, class(frame$Var1))
    
     -- 100. Error: Full SimulatedIncidenceMatrix : addError respects mat ----------
     no method or default for coercing "character" to "factor"
     Backtrace:
     1. testthat::expect_equal(first_object, object)
     16. methods::as(tmp_frame$Var1, class(frame$Var1))
    
     -- 101. Error: Full SimulatedIncidenceMatrix : addError respects simulations --
     no method or default for coercing "character" to "factor"
     Backtrace:
     1. testthat::expect_equal(first_object, object)
     16. methods::as(tmp_frame$Var1, class(frame$Var1))
    
     -- 102. Error: Full SimulatedIncidenceMatrix : addError respects arr ----------
     no method or default for coercing "character" to "factor"
     Backtrace:
     1. testthat::expect_equal(first_object, object)
     16. methods::as(tmp_frame$Var1, class(frame$Var1))
    
     -- 103. Error: Full SimulatedIncidenceMatrix : summarize works ----------------
     no method or default for coercing "character" to "factor"
     Backtrace:
     1. testthat::expect_equal(first_object, object)
     16. methods::as(tmp_frame$Var1, class(frame$Var1))
    
     -- 104. Error: List SimulatedIncidenceMatrix : Active bindings have correct mode
     no method or default for coercing "character" to "factor"
     Backtrace:
     1. testthat::expect_equal(first_object, object)
     16. methods::as(tmp_frame$Var1, class(frame$Var1))
    
     -- 105. Error: List SimulatedIncidenceMatrix : tail respects mat --------------
     no method or default for coercing "character" to "factor"
     Backtrace:
     1. testthat::expect_equal(object, firstObject)
     16. methods::as(tmp_frame$Var1, class(frame$Var1))
    
     -- 106. Error: List SimulatedIncidenceMatrix : tail respects simulations ------
     no method or default for coercing "character" to "factor"
     Backtrace:
     1. testthat::expect_equal(object, firstObject)
     16. methods::as(tmp_frame$Var1, class(frame$Var1))
    
     -- 107. Error: List SimulatedIncidenceMatrix : tail respects arr --------------
     no method or default for coercing "character" to "factor"
     Backtrace:
     1. testthat::expect_equal(object, firstObject)
     16. methods::as(tmp_frame$Var1, class(frame$Var1))
    
     -- 108. Error: List SimulatedIncidenceMatrix : mutate works -------------------
     no method or default for coercing "character" to "factor"
     Backtrace:
     1. testthat::expect_equal(object, firstObject)
     16. methods::as(tmp_frame$Var1, class(frame$Var1))
    
     -- 109. Error: List SimulatedIncidenceMatrix : subset respects mat ------------
     no method or default for coercing "character" to "factor"
     Backtrace:
     1. testthat::expect_equal(object, firstObject)
     16. methods::as(tmp_frame$Var1, class(frame$Var1))
    
     -- 110. Error: List SimulatedIncidenceMatrix : subset respects simulations ----
     no method or default for coercing "character" to "factor"
     Backtrace:
     1. testthat::expect_equal(object, firstObject)
     16. methods::as(tmp_frame$Var1, class(frame$Var1))
    
     -- 111. Error: List SimulatedIncidenceMatrix : subset respects arr ------------
     no method or default for coercing "character" to "factor"
     Backtrace:
     1. testthat::expect_equal(object, firstObject)
     16. methods::as(tmp_frame$Var1, class(frame$Var1))
    
     -- 112. Error: List SimulatedIncidenceMatrix : mutate works -------------------
     no method or default for coercing "character" to "factor"
     Backtrace:
     1. testthat::expect_equal(object, firstObject)
     16. methods::as(tmp_frame$Var1, class(frame$Var1))
    
     -- 113. Error: List SimulatedIncidenceMatrix : subset respects mat ------------
     no method or default for coercing "character" to "factor"
     Backtrace:
     1. testthat::expect_equal(object, firstObject)
     16. methods::as(tmp_frame$Var1, class(frame$Var1))
    
     -- 114. Error: List SimulatedIncidenceMatrix : subset respects simulations ----
     no method or default for coercing "character" to "factor"
     Backtrace:
     1. testthat::expect_equal(object, firstObject)
     16. methods::as(tmp_frame$Var1, class(frame$Var1))
    
     -- 115. Error: List SimulatedIncidenceMatrix : subset respects arr ------------
     no method or default for coercing "character" to "factor"
     Backtrace:
     1. testthat::expect_equal(object, firstObject)
     16. methods::as(tmp_frame$Var1, class(frame$Var1))
    
     -- 116. Error: List SimulatedIncidenceMatrix : addColumns respects mat --------
     no method or default for coercing "character" to "factor"
     Backtrace:
     1. testthat::expect_equal(object, firstObject)
     16. methods::as(tmp_frame$Var1, class(frame$Var1))
    
     -- 117. Error: List SimulatedIncidenceMatrix : addColumns respects simulations
     no method or default for coercing "character" to "factor"
     Backtrace:
     1. testthat::expect_equal(object, firstObject)
     16. methods::as(tmp_frame$Var1, class(frame$Var1))
    
     -- 118. Error: List SimulatedIncidenceMatrix : addColumns respects arr --------
     no method or default for coercing "character" to "factor"
     Backtrace:
     1. testthat::expect_equal(object, firstObject)
     16. methods::as(tmp_frame$Var1, class(frame$Var1))
    
     -- 119. Error: List SimulatedIncidenceMatrix : addRows respects mat -----------
     no method or default for coercing "character" to "factor"
     Backtrace:
     1. testthat::expect_equal(object, firstObject)
     16. methods::as(tmp_frame$Var1, class(frame$Var1))
    
     -- 120. Error: List SimulatedIncidenceMatrix : addRows respects simulations ---
     no method or default for coercing "character" to "factor"
     Backtrace:
     1. testthat::expect_equal(object, firstObject)
     16. methods::as(tmp_frame$Var1, class(frame$Var1))
    
     -- 121. Error: List SimulatedIncidenceMatrix : addRows respects arr -----------
     no method or default for coercing "character" to "factor"
     Backtrace:
     1. testthat::expect_equal(object, firstObject)
     16. methods::as(tmp_frame$Var1, class(frame$Var1))
    
     -- 122. Error: List SimulatedIncidenceMatrix : diff works ---------------------
     no method or default for coercing "character" to "factor"
     Backtrace:
     1. testthat::expect_equal(object, first_object)
     16. methods::as(tmp_frame$Var1, class(frame$Var1))
    
     -- 123. Error: List SimulatedIncidenceMatrix : diff respects cnames -----------
     no method or default for coercing "character" to "factor"
     Backtrace:
     1. testthat::expect_equal(object, first_object)
     16. methods::as(tmp_frame$Var1, class(frame$Var1))
    
     -- 124. Error: List SimulatedIncidenceMatrix : diff respects ncol -------------
     no method or default for coercing "character" to "factor"
     Backtrace:
     1. testthat::expect_equal(object, first_object)
     16. methods::as(tmp_frame$Var1, class(frame$Var1))
    
     -- 125. Error: List SimulatedIncidenceMatrix : diff respects nsim -------------
     no method or default for coercing "character" to "factor"
     Backtrace:
     1. testthat::expect_equal(object, first_object)
     16. methods::as(tmp_frame$Var1, class(frame$Var1))
    
     -- 126. Error: List SimulatedIncidenceMatrix : diff respects nrow -------------
     no method or default for coercing "character" to "factor"
     Backtrace:
     1. testthat::expect_equal(object, first_object)
     16. methods::as(tmp_frame$Var1, class(frame$Var1))
    
     -- 127. Error: List SimulatedIncidenceMatrix : diff respects rnames -----------
     no method or default for coercing "character" to "factor"
     Backtrace:
     1. testthat::expect_equal(object, first_object)
     16. methods::as(tmp_frame$Var1, class(frame$Var1))
    
     -- 128. Error: List SimulatedIncidenceMatrix : diff respects colData ----------
     no method or default for coercing "character" to "factor"
     Backtrace:
     1. testthat::expect_equal(object, first_object)
     16. methods::as(tmp_frame$Var1, class(frame$Var1))
    
     -- 129. Error: List SimulatedIncidenceMatrix : diff respects mat --------------
     no method or default for coercing "character" to "factor"
     Backtrace:
     1. testthat::expect_equal(object, first_object)
     16. methods::as(tmp_frame$Var1, class(frame$Var1))
    
     -- 130. Error: List SimulatedIncidenceMatrix : diff respects simulations ------
     no method or default for coercing "character" to "factor"
     Backtrace:
     1. testthat::expect_equal(object, first_object)
     16. methods::as(tmp_frame$Var1, class(frame$Var1))
    
     -- 131. Error: List SimulatedIncidenceMatrix : diff respects arr --------------
     no method or default for coercing "character" to "factor"
     Backtrace:
     1. testthat::expect_equal(object, first_object)
     16. methods::as(tmp_frame$Var1, class(frame$Var1))
    
     -- 132. Error: List SimulatedIncidenceMatrix : diff respects metaData ---------
     no method or default for coercing "character" to "factor"
     Backtrace:
     1. testthat::expect_equal(object, first_object)
     16. methods::as(tmp_frame$Var1, class(frame$Var1))
    
     -- 133. Error: List SimulatedIncidenceMatrix : diff respects rowData ----------
     no method or default for coercing "character" to "factor"
     Backtrace:
     1. testthat::expect_equal(object, first_object)
     16. methods::as(tmp_frame$Var1, class(frame$Var1))
    
     -- 134. Error: List SimulatedIncidenceMatrix : head respects mat --------------
     no method or default for coercing "character" to "factor"
     Backtrace:
     1. testthat::expect_equal(object, firstObject)
     16. methods::as(tmp_frame$Var1, class(frame$Var1))
    
     -- 135. Error: List SimulatedIncidenceMatrix : head respects simulations ------
     no method or default for coercing "character" to "factor"
     Backtrace:
     1. testthat::expect_equal(object, firstObject)
     16. methods::as(tmp_frame$Var1, class(frame$Var1))
    
     -- 136. Error: List SimulatedIncidenceMatrix : head respects arr --------------
     no method or default for coercing "character" to "factor"
     Backtrace:
     1. testthat::expect_equal(object, firstObject)
     16. methods::as(tmp_frame$Var1, class(frame$Var1))
    
     -- 137. Error: List SimulatedIncidenceMatrix : scale works --------------------
     no method or default for coercing "character" to "factor"
     Backtrace:
     1. testthat::expect_equal(first_object, object)
     16. methods::as(tmp_frame$Var1, class(frame$Var1))
    
     -- 138. Error: List SimulatedIncidenceMatrix : scale respects nrow ------------
     no method or default for coercing "character" to "factor"
     Backtrace:
     1. testthat::expect_equal(first_object, object)
     16. methods::as(tmp_frame$Var1, class(frame$Var1))
    
     -- 139. Error: List SimulatedIncidenceMatrix : scale respects ncol ------------
     no method or default for coercing "character" to "factor"
     Backtrace:
     1. testthat::expect_equal(first_object, object)
     16. methods::as(tmp_frame$Var1, class(frame$Var1))
    
     -- 140. Error: List SimulatedIncidenceMatrix : scale respects nsim ------------
     no method or default for coercing "character" to "factor"
     Backtrace:
     1. testthat::expect_equal(first_object, object)
     16. methods::as(tmp_frame$Var1, class(frame$Var1))
    
     -- 141. Error: List SimulatedIncidenceMatrix : scale respects cnames ----------
     no method or default for coercing "character" to "factor"
     Backtrace:
     1. testthat::expect_equal(first_object, object)
     16. methods::as(tmp_frame$Var1, class(frame$Var1))
    
     -- 142. Error: List SimulatedIncidenceMatrix : scale respects rnames ----------
     no method or default for coercing "character" to "factor"
     Backtrace:
     1. testthat::expect_equal(first_object, object)
     16. methods::as(tmp_frame$Var1, class(frame$Var1))
    
     -- 143. Error: List SimulatedIncidenceMatrix : scale respects colData ---------
     no method or default for coercing "character" to "factor"
     Backtrace:
     1. testthat::expect_equal(first_object, object)
     16. methods::as(tmp_frame$Var1, class(frame$Var1))
    
     -- 144. Error: List SimulatedIncidenceMatrix : scale respects rowData ---------
     no method or default for coercing "character" to "factor"
     Backtrace:
     1. testthat::expect_equal(first_object, object)
     16. methods::as(tmp_frame$Var1, class(frame$Var1))
    
     -- 145. Error: List SimulatedIncidenceMatrix : scale respects metaData --------
     no method or default for coercing "character" to "factor"
     Backtrace:
     1. testthat::expect_equal(first_object, object)
     16. methods::as(tmp_frame$Var1, class(frame$Var1))
    
     -- 146. Error: List SimulatedIncidenceMatrix : scale respects mat -------------
     no method or default for coercing "character" to "factor"
     Backtrace:
     1. testthat::expect_equal(first_object, object)
     16. methods::as(tmp_frame$Var1, class(frame$Var1))
    
     -- 147. Error: List SimulatedIncidenceMatrix : scale respects simulations -----
     no method or default for coercing "character" to "factor"
     Backtrace:
     1. testthat::expect_equal(first_object, object)
     16. methods::as(tmp_frame$Var1, class(frame$Var1))
    
     -- 148. Error: List SimulatedIncidenceMatrix : scale respects arr -------------
     no method or default for coercing "character" to "factor"
     Backtrace:
     1. testthat::expect_equal(first_object, object)
     16. methods::as(tmp_frame$Var1, class(frame$Var1))
    
     -- 149. Error: List SimulatedIncidenceMatrix : addError works -----------------
     no method or default for coercing "character" to "factor"
     Backtrace:
     1. testthat::expect_equal(first_object, object)
     16. methods::as(tmp_frame$Var1, class(frame$Var1))
    
     -- 150. Error: List SimulatedIncidenceMatrix : addError respects ncol ---------
     no method or default for coercing "character" to "factor"
     Backtrace:
     1. testthat::expect_equal(first_object, object)
     16. methods::as(tmp_frame$Var1, class(frame$Var1))
    
     -- 151. Error: List SimulatedIncidenceMatrix : addError respects nrow ---------
     no method or default for coercing "character" to "factor"
     Backtrace:
     1. testthat::expect_equal(first_object, object)
     16. methods::as(tmp_frame$Var1, class(frame$Var1))
    
     -- 152. Error: List SimulatedIncidenceMatrix : addError respects ncol ---------
     no method or default for coercing "character" to "factor"
     Backtrace:
     1. testthat::expect_equal(first_object, object)
     16. methods::as(tmp_frame$Var1, class(frame$Var1))
    
     -- 153. Error: List SimulatedIncidenceMatrix : addError respects cnames -------
     no method or default for coercing "character" to "factor"
     Backtrace:
     1. testthat::expect_equal(first_object, object)
     16. methods::as(tmp_frame$Var1, class(frame$Var1))
    
     -- 154. Error: List SimulatedIncidenceMatrix : addError respects rnames -------
     no method or default for coercing "character" to "factor"
     Backtrace:
     1. testthat::expect_equal(first_object, object)
     16. methods::as(tmp_frame$Var1, class(frame$Var1))
    
     -- 155. Error: List SimulatedIncidenceMatrix : addError respects colData ------
     no method or default for coercing "character" to "factor"
     Backtrace:
     1. testthat::expect_equal(first_object, object)
     16. methods::as(tmp_frame$Var1, class(frame$Var1))
    
     -- 156. Error: List SimulatedIncidenceMatrix : addError respects rowData ------
     no method or default for coercing "character" to "factor"
     Backtrace:
     1. testthat::expect_equal(first_object, object)
     16. methods::as(tmp_frame$Var1, class(frame$Var1))
    
     -- 157. Error: List SimulatedIncidenceMatrix : addError respects metaData -----
     no method or default for coercing "character" to "factor"
     Backtrace:
     1. testthat::expect_equal(first_object, object)
     16. methods::as(tmp_frame$Var1, class(frame$Var1))
    
     -- 158. Error: List SimulatedIncidenceMatrix : addError respects metaData -----
     no method or default for coercing "character" to "factor"
     Backtrace:
     1. testthat::expect_equal(first_object, object)
     16. methods::as(tmp_frame$Var1, class(frame$Var1))
    
     -- 159. Error: List SimulatedIncidenceMatrix : addError respects nsim ---------
     no method or default for coercing "character" to "factor"
     Backtrace:
     1. testthat::expect_equal(first_object, object)
     16. methods::as(tmp_frame$Var1, class(frame$Var1))
    
     -- 160. Error: List SimulatedIncidenceMatrix : addError respects nsim ---------
     no method or default for coercing "character" to "factor"
     Backtrace:
     1. testthat::expect_equal(first_object, object)
     16. methods::as(tmp_frame$Var1, class(frame$Var1))
    
     -- 161. Error: List SimulatedIncidenceMatrix : addError respects mat ----------
     no method or default for coercing "character" to "factor"
     Backtrace:
     1. testthat::expect_equal(first_object, object)
     16. methods::as(tmp_frame$Var1, class(frame$Var1))
    
     -- 162. Error: List SimulatedIncidenceMatrix : addError respects simulations --
     no method or default for coercing "character" to "factor"
     Backtrace:
     1. testthat::expect_equal(first_object, object)
     16. methods::as(tmp_frame$Var1, class(frame$Var1))
    
     -- 163. Error: List SimulatedIncidenceMatrix : addError respects arr ----------
     no method or default for coercing "character" to "factor"
     Backtrace:
     1. testthat::expect_equal(first_object, object)
     16. methods::as(tmp_frame$Var1, class(frame$Var1))
    
     -- 164. Error: List SimulatedIncidenceMatrix : summarize works ----------------
     no method or default for coercing "character" to "factor"
     Backtrace:
     1. testthat::expect_equal(first_object, object)
     16. methods::as(tmp_frame$Var1, class(frame$Var1))
    
     -- 165. Error: Full IncidenceForecast : mean works ----------------------------
     no method or default for coercing "character" to "factor"
     Backtrace:
     1. testthat::expect_that(...)
     20. methods::as(tmp_frame$Var1, class(frame$Var1))
    
     -- 166. Error: Full IncidenceForecast : median works --------------------------
     no method or default for coercing "character" to "factor"
     Backtrace:
     1. testthat::expect_that(...)
     20. methods::as(tmp_frame$Var1, class(frame$Var1))
    
     -- 167. Error: Full IncidenceForecast : Inherited Methods don't change object -
     no method or default for coercing "character" to "factor"
     Backtrace:
     1. equivalence(first_object)(object)
     19. methods::as(tmp_frame$Var1, class(frame$Var1))
    
     -- 168. Error: Full IncidenceForecast : sample works --------------------------
     no method or default for coercing "character" to "factor"
     Backtrace:
     1. testthat::expect_that(first_object, equals(object))
     28. methods::as(tmp_frame$Var1, class(frame$Var1))
    
     == testthat results ===========================================================
     [ OK: 10173 | SKIPPED: 207 | WARNINGS: 123 | FAILED: 168 ]
     1. Error: Full IncidenceMatrix : Active bindings have correct mode.
     2. Error: Full IncidenceMatrix : tail respects mat
     3. Error: Full IncidenceMatrix : mutate works
     4. Error: Full IncidenceMatrix : mutate respects nrow
     5. Error: Full IncidenceMatrix : mutate respects ncol
     6. Error: Full IncidenceMatrix : mutate respects rnames
     7. Error: Full IncidenceMatrix : mutate respects cnames
     8. Error: Full IncidenceMatrix : mutate respects metaData
     9. Error: Full IncidenceMatrix : mutate respects rowData
     1. ...
    
     Error: testthat unit tests failed
     Execution halted
Flavor: r-devel-windows-ix86+x86_64